{"text_format":"1","workbook":"xlsx","n_sheets":6,"sheets":["FY25-26 Work Plan","Instructions","Site Locations","Data Validation","Data to Append","Data Validation Instructions"],"not_rendered":{"charts":0,"images":10,"macros":1,"external_links":1,"defined_names":3,"comments":0,"pivot_tables":0},"unopened":[],"bounds":{"document_bytes":16777216,"sheet_cells":100000,"rows_first":2000,"rows_last":500,"rows_between":2000,"halvings":0,"cell_chars":16384,"cell_head_chars":4096},"cells_cut":0,"cells_raw":0,"read":"whole","date_system":"1900"}

{"sheet":"FY25-26 Work Plan","index":0,"n_rows":44,"n_cols":15,"rows_kept":44,"cut":false,"hidden":false,"merged":[[16,11,16,15],[41,0,41,1],[42,0,42,1],[43,0,43,1],[35,13,35,15],[18,0,18,3],[17,0,17,3],[18,8,18,10],[18,4,18,7],[17,4,17,7],[33,5,34,5],[30,4,30,7],[30,8,30,15],[31,4,31,7],[31,8,31,15],[20,0,20,15],[17,8,17,10],[17,11,17,15],[25,4,25,7],[25,8,25,15],[26,4,26,7],[26,8,26,15],[33,12,34,12],[27,0,27,3],[33,10,34,11],[36,10,36,11],[33,8,34,9],[36,8,36,9],[18,11,18,15],[29,1,29,3],[22,4,22,7],[22,8,22,15],[21,8,21,15],[21,4,21,7],[21,0,21,3],[23,4,23,7],[33,0,34,1],[28,0,28,3],[26,0,26,3],[3,0,3,3],[7,4,7,9],[8,0,9,3],[10,0,11,3],[3,4,3,6],[2,4,2,6],[13,8,13,10],[13,4,13,7],[16,4,16,7],[15,4,15,7],[14,4,14,7],[1,0,1,3],[11,11,11,15],[24,0,24,3],[23,0,23,3],[22,0,22,3],[15,11,15,15],[14,11,14,15],[13,11,13,15],[16,0,16,3],[15,0,15,3],[14,0,14,3],[13,0,13,3],[10,4,11,7],[8,4,9,7],[14,8,14,10],[15,8,15,10],[16,8,16,10],[10,8,10,10],[11,8,11,10],[2,0,2,3],[7,0,7,3],[6,0,6,3],[5,0,5,3],[4,0,4,3],[23,8,23,15],[24,4,24,7],[24,8,24,15],[0,0,0,15],[3,8,3,10],[4,8,4,10],[1,8,1,10],[2,8,2,10],[10,11,10,15],[8,8,8,10],[9,8,9,10],[9,11,9,15],[8,11,8,15],[5,11,5,15],[6,14,6,15],[7,14,7,15],[6,4,6,9],[5,4,5,9],[4,4,4,6],[1,4,1,6],[1,11,1,14],[2,11,2,14],[3,11,3,14],[4,11,4,14],[28,8,28,15],[29,4,29,7],[29,8,29,15],[33,6,34,7],[33,3,33,4],[25,0,25,3],[38,13,38,15],[39,13,39,15],[40,13,40,15],[36,6,36,7],[38,6,38,7],[38,8,38,9],[38,10,38,11],[33,2,34,2],[33,13,34,15],[31,1,31,3],[30,1,30,3],[27,4,27,7],[27,8,27,15],[28,4,28,7],[38,0,38,1],[39,0,39,1],[40,0,40,1],[36,0,36,1],[42,4,43,4],[35,0,35,1],[41,8,41,9],[41,10,41,11],[39,6,39,7],[40,6,40,7],[43,8,43,9],[43,10,43,11],[42,13,43,15],[39,8,39,9],[39,10,39,11],[41,13,41,15],[43,6,43,7],[42,6,42,7],[42,8,42,9],[42,10,42,11],[41,6,41,7],[37,8,37,9],[37,10,37,11],[35,8,35,9],[35,6,35,7],[36,13,37,15],[40,8,40,9],[40,10,40,11]]}
["PREVENTION WORK PLAN FY 2025-2026\nSubstance Abuse Prevention and Control - Alcohol and Other Drug Prevention Services "]
["Contractor Name:",null,null,null,"Asian American Drug Abuse Programs, Inc. (AADAP)",null,null,null,"Contract Type (CCP, PEP, Other):",null,null,"Prevention Education Program (PEP)"]
["Contract Number:",null,null,null,"PH-005150 ",null,null,null,"If other contract type, please specify:"]
["Provider ID:",null,null,null,1,null,null,null,"Evidence Based Program/s Used:"]
["Service Planning Area Served:",null,null,null,"2 - San Fernando Valley",null,null,null,"Supervisorial District/s Served:"]
["Cities and Unincorporated Areas* Served:",null,null,null,"Agoura Hills, Agua Dulce*",null,null,null,null,null,null,"Priority Substances for Your Local Communities                             "]
["If City of LA, list the communities served:",null,null,null,"Angelino Heights, Atwater Village",null,null,null,null,null,null,"Major #1","Major #2","Minor #1","Minor #2"]
["Zip Codes Served:",null,null,null,"90002, 90004",null,null,null,null,null,null,"Marijuana"]
["Contractor Corporate Address:",null,null,null,"123 E Main St., Suite 100 \nAnytown, CA 90000",null,null,null,"Phone:",null,null,9999999999]
[null,null,null,null,null,null,null,null,"Website:",null,null,"www.abc1.org"]
["Primary Facilty Site Address:",null,null,null,"123 E Main St., Suite 100 \nAnytown, CA 90000",null,null,null,"Phone:",null,null,9999999999]
[null,null,null,null,null,null,null,null,"Website:",null,null,"www.abc2.org"]
[]
["Position",null,null,null,"Name",null,null,null,"Phone",null,null,"Email"]
["Executive Director:",null,null,null,"John/Jane Doe",null,null,null,2135551212,null,null,"janedoe@preventionusa.com"]
["Prevention Program Director:",null,null,null,"John/Jane Doe",null,null,null,2135551212,null,null,"janedoe@preventionusa.com"]
["Prevention Program Coordinator:",null,null,null,"John/Jane Doe",null,null,null,2135551212,null,null,"j.doe@preventionusa.com"]
["Alternate Contact 1 (or the person required on all communications):",null,null,null,"John/Jane Doe",null,null,null,2135551213,null,null,"j.doe@preventionusa.com"]
["Alternate Contact 2 (or the person required on all communications):",null,null,null,"John/Jane Doe",null,null,null,2135551213,null,null,"j.doe@preventionusa.com"]
[]
["Social Media Site or Other Online Platform"]
["Platform",null,null,null,"Name/Handle",null,null,null,"URL"]
["Facebook"]
["Instagram"]
["Podcast"]
["Snapchat"]
["Twitter"]
["TikTok"]
["YouTube"]
["Other:"]
["Other:"]
["Other:"]
[]
["Priority Substances Being Addressed through this Project (check all applicable)",null,"Program or Project Name ","Evidence Based Program (EBP) ",null,"Process/Outcome Objectives","Program Activities",null,"Evaluation Measures",null,"Start Date",null,"End Date","Long-term Outcomes"]
[null,null,null,"EBP (Yes/No)","Proof of Effectiveness (Registry or Research Article Reference)"]
[]
["Alcohol, Marijuana, Rx-Opioids/Fentanyl, Rx (incl. Fentanyl)",null,"Program A SUD Prevention Program at Rydell High School ","Yes","https://www.blueprintsprograms.org/","Process: \nBy September 2025, Agency A will enroll 100 students into the Program A SUD Prevention Program.","• Garner buy-in from principal to not only adopt program but to provide infrasture (e.g. designated room, materials, flyers, table for outreach, etc.) to assist with enrollment.\n• Establish year-long presence by providing outreach, office hours, before and after school to ensure sustainability of program.    \n• Deliver school-wide presentation providing awarenes around SUD disorder and information about the Program A SUD Prevention Program.",null,"Enrollment Log, Outreach flyers distributed",null,"2025-07-25",null,"2025-09-25","By 2028, 5 students who have completed the program, will serve as peer advisors for the program for incoming Freshman. "]
[null,null,"Program A SUD Prevention Program at Rydell High School ",null,null,"Process:\nBy June 2026, 80% of enrolled students will complete the program, as measured by a student attending at least five of six sessions, including final session.","• Offer 1:1 check-ins with students\n• Provide gift card incentive to students who attend at least five of six sessions, including final session.",null,"Sign in sheets, Gift card Log",null,"2025-07-25",null,"2025-06-26"]
[null,null,"Program A SUD Prevention Program at Rydell High School ",null,null,"Process: \nBy September 2025, Agency A will enroll 50 parents into the Program A SUD Prevention Program.","• Provide interpretation services.\n• Provide gift card incentive to parents who attend all three sessions.",null,"Enrollment Log, Gift card Log",null,"2025-07-25",null,"2025-06-26","Six month follow-up, parents will indicate that their children have demonstrated mostly positive outcomes in qualitative interview. "]
[null,null,"Program A SUD Prevention Program at Rydell High School ",null,null,"Outcome:\nBy June 2025, 90% of students who complete the program will demonstrate an improved knowledge score over baseline. ","• Participant-engaged discussion groups and games to increase awareness.\n• Pre- and post-test questionnaires  ",null,"Participation observation by Evaluation Consultant.          ·    Questionnaire administered by health educators.",null,"2025-10-25",null,"2025-06-26","Six month follow-up, students will retain improved knowledge over baseline.\n\nThree year follow-up, students will demonstrate 3 percentage points higher graduation rates than peers in their district. "]
[null,null,"Program A SUD Prevention Program at Rydell High School ",null,null,"Outcome:\nBy June 2025, 80% of students who complete the program, will demonstrate improved resiliency scores over baseline.","• Role-play, mock party\n• Provide lessons on life-skill building - supporting mental health. \n• Pre- and post-test questionnaires  ",null,"Participation observation by Evaluation Consultant.    \nQuestionnaire administered by health educators.",null,"2025-10-25",null,"2025-06-26","Six month follow-up, students will retain improved resiliency scores over baseline.\n\nThree year follow-up, students will demonstrate 3 percentage points lower absenteeism rates than peers in their district. "]
[null,null,"Program A SUD Prevention Program at Rydell High School ",null,"Bator, R.J. and Cialdini, RB (1990), The Application of Persuasion Theory\nto the Development Of Effective Proenvironmental\nPublic Service Announcements, Journal of Social Issues, Vol. 56, No. 3, 2000, pp. 527–541","Outcome:\nBy June 2025, 70% of students who complete the program, will demonstrate intention to change behavior by signing a pledge to delay alcohol/marijuana use.","• Offer pledges to students at the end of the program.  ",null,"Signed Pledges",null,"2025-01-26",null,"2025-06-26","Six month follow-up, students will agree to sign second-pledge.\n\nThree year follow-up, students will demonstrate 3 percentage points lower suspension rates than peers in their district. "]
["Alcohol",null,"Retail Engagement / Merchant Committed","No","Local Innovative: The Merchant Committed campaign encourages retailers to fully adopt preventive practices as part of their business operations.  As part of this effort, there will be Policy Development campaigns to encourage the city to improve its oversight of off-sale outlets through community policing and Conditional Use Permit (CUP) administration. This program has been implemented by the SAPC network for several years.","Process:\nBy December 2025, enroll at least 50 alcohol retailers within SPA 1, to participate in the Retail Engagement/ Merchant Comitted progarm.","• Map local region for licensed alcohol retailers. \n• Develop materials for engagement.\n• Participating retailers to participate in Responsible Beverage Server (RBS) training",null,"Completed GIS map, Sign in sheets",null,"2025-07-25",null,"2025-12-25","Based on 2026 Community Needs Assessment, teen respondents will report a 5% decrease in perceived accessibility to alcohol compared to 2022 CNA. "]
[null,null,"Retail Engagement / Merchant Committed","No",null,"Outcome:\nBy June 2026, reports from ABC to indicate 15% less violations from Agency A's service area.","• Pseudo decoy buys\n• Sticker shock - stickers with prevention messaging strategically placed on beverage containers to remind adults that purchasing alcohol for minors is illegal ",null,"ABC Reports",null,"2025-07-25",null,"2025-06-26"]

{"sheet":"Instructions","index":1,"n_rows":64,"n_cols":4,"rows_kept":64,"cut":false,"hidden":false,"merged":[[7,1,24,1],[25,1,29,1],[30,1,32,1],[0,1,0,3],[37,2,37,3],[33,1,44,1]]}
[null,"FY 2025-2026 Work Plan Instructions"]
[]
[null,null,"Upon opening the workbook, please ensure to enable macros by clicking on 'Enable Content' when you see the following message.  "]
[]
[]
[]
[null,null,"Data Entry Fields","Instructions/Information"]
[null,"GENERAL INFORMATION","Contractor Name:","Single-select drop-down list. \nName of your agency/organization."]
[null,null,"Contract Number:","Single-select drop-down list."]
[null,null,"Provider ID:","Your 6-digit ID number used for logging into PPSDS."]
[null,null,"Service Planning Area Served:","Single-select drop-down list."]
[null,null,"Contract Type (CCP, PEP, Other):","Single-select drop-down list."]
[null,null,"If other contract type, please specify:","If you selected 'Other' in the field above for Contract Type, then specify your special project or program here."]
[null,null,"Evidence Based Program/s Used:","Multi-select drop-down list. \nNote, this list includes EBPs that are recommended by SAPC on the Prevention Program Manual. If you use an EBP that is not on this list, you may manually type them in the field instead of selecting from the drop-down list."]
[null,null,"Supervisorial District/s Served:","Multi-select drop-down list. "]
[null,null,"Cities and Unincorporated Areas* Served:","Multi-select drop-down list. \nSelections with an asterisk (*) are Unincorporated Areas. "]
[null,null,"If City of LA, list the communities served:","Multi-select drop-down list. \nIf you selected Los Angeles in the field above, indicate the communities within Los Angeles that you serve."]
[null,null,"Zip Codes Served:","Multi-select drop-down list. "]
[null,null,"Priority Substances for Your Local Communities (in the order of priority) ","Multi-select drop-down list. \nSelect 2 major and 2 minor priority substances (alcohol, marijuana, methamphetamine, prescription drugs) for your agency or your local area."]
[null,null,"Contractor Address:","Your main address. "]
[null,null,"Phone:","General phone number for your main address. Enter 10-digits only. Do not include symbols like dashes, periods, or parentheses (e.g., - . ( ))."]
[null,null,"Website:","Main website."]
[null,null,"Address for Additional Location:","Additional/secondary address."]
[null,null,"Phone:","General phone number for your secondary address. Enter 10-digits only. Do not include symbols like dashes, periods, or parentheses (e.g., - . ( ))."]
[null,null,"Website:","Website for additional location. If it's the same as your main website, enter the main website in this field."]
[null,"CONTACTS","Executive Director:","Provide the Name (first and last), Phone, and Email. Enter only 10-digits for phone number."]
[null,null,"Prevention Program Director:","Provide the Name (first and last), Phone, and Email. Enter only 10-digits for phone number."]
[null,null,"Prevention Program Coordinator:","Provide the Name (first and last), Phone, and Email. Enter only 10-digits for phone number."]
[null,null,"Alternate Contact 1 (or the person required on all communications):","If you have additional Prevention Program Coordinators, you may add their contact here. Provide the Name (first and last), Phone, and Email. Enter only 10-digits for phone number."]
[null,null,"Alternate Contact 2 (or the person required on all communications):","If you have additional Prevention Program Coordinators, you may add their contact here. Provide the Name (first and last), Phone, and Email. Enter only 10-digits for phone number."]
[null,"SOCIAL MEDIA","Platform:","Popular platforms have been provided. If you use other platforms that are not listed, type the platform(s) in the field next to where it says 'Other:'."]
[null,null,"Name/Handle:","Provide the Name or Handle of the corresponding platform. E.g, @YourTwitterHandle, @YourFacebookPage, @Your_Instagram, +Your_Google_Name, YourUsername, etc."]
[null,null,"URL:","If applicable, provide the URL of your social media site. "]
[null,"PROJECTS","Priority Substances Being Addressed through This Project (check all applicable):","Multi-select drop-down list. \nSelect one or more of the 4 priority substances (alcohol, marijuana, methamphetamine, prescription drugs) being addressed through this particular project.  Example: CMCA, addressing alcohol, or PSI addressing marijuana"]
[null,null,"Program or Project Name ","Please name your project or program (e.g., Lifeskills, Winners Sankofa, etc.)"]
[null,null,"Evidence Based (EBP/Local Innovative)","From the pull down menu, select yes for EBP and No for local innovative \n•\tFor Evidence Based Programs, please see the Prevention Standards Manual http://ph.lacounty.gov/sapc/prevention/PV/PreventionStandardsManual.pdf  (attachment C ) for the list of EBP programs. For a list of Environmental Prevention programs, see FY 22-23-SAPC-Prevention-Providers-Report, Appendix D. If they are listed as an Evidence Based Programs in the Prevention Standards Manual or in cell L4, within this work plan, you can enter 'SAPC Recognized Evidenced Based Program'. \n•\tFor Evidence Based Programs listed in a SAPC-recognized registry, such as those listed in the Prevention Standards Manual - page 23, enter the name of the registry.\n•\tFor Local Innovative Programs, refer to research including journal articles, research conducted with Evaluators or HODA, additional narrative as to why program is promising/effective. \n•\tFor Local Innovative Projects that are major events, include a narrative as to why your program will be effective, (e.g., we modeled our event after a successful event conducted in Northern CA or we included Law Enforcement b/c according to our local assessment there was a mistrust among the community and we wished to bridge the divide, we focused on youth b/c our assessment indicated that middle school students in a certain community were accessing marijuana at very high rates, etc.)  \n•\tFor other Local Innovative Projects that are mandated by SAPC as part of contract, such as your SPA-based Coalition, you can enter 'Local Innovative - Required by SAPC Contract'."]
[null,null,"Proff of Effectiveness","Provide a link to EBP Registries or peer reviewed journals"]
[null,null,"Process/Outcome Objectives"]
[null,null,"Process Objectives:","Objective used to measure if the program was implemented as planned/intended.  Process Objectives are more often short-term and focus on the fidelity of how activities/services were delivered.  Should be SMART (Specific Measureable Achievable Relevant Time-bound). "]
[null,null,"Outcome Objectives:","Objective that measures the degree to which the program/project positively affects the knowledge, attitudes, beliefs, behaviors, or health of the target population/community. Should be SMART (Specific Measureable Achievable Relevant Time-bound). "]
[null,null,"Program Activities:","Provide a brief description of activities."]
[null,null,"Evaluation Measures","Method(s)/documentation/product/data you will use to evaluate your project:\n(Process) e.g., sign-in sheets, log of all local outlets contacted, number of educational materials provided, gift card logs, completed GIS map, etc.\n(Outcome) e.g., pre/post surveys, ABC violations in service area, signed pledges indicating intention to change behavior, etc."]
[null,null,"Start Date:","Enter EXACT project start date in the format, mm/dd/yyyy (may/may not necessarily coincide with the start of FY)."]
[null,null,"End Date:","Enter EXACT project end date in the format, mm/dd/yyyy (may/may not necessarily coincide with the end of FY)."]
[null,null,"Long-term Outcomes:","Outcomes that focus on a long-term knowledge/behavior/health impact of the project that will ultimately be measured beyond the one-year evaluation period.  Because of this, long-term outcomes can be repeated in a consecutive year(s) within the contract."]
[]
[]
[null,"Drop-Down List Instructions:"]
[null,"Fields with single-select drop-down lists:"]
[null,"-To open the drop-down list, click on the field/cell, then click on the drop-down arrow located on the bottom right corner of the field. ","Contractor Name"]
[null,"•","Contract Number"]
[null,"•","Service Planning Area Served"]
[null,"•","Contract Type (CCP, PEP, Other)"]
[null,"•"]
[null,"Fields with multi-select drop-down lists:"]
[null,"-Select from the drop-down list and repeat to make additional selections."]
[null,"-Additional selections will automatically be added to the field and separated with a comma."]
[null,"-To remove a selection, select the same option again from the drop-down list."]
[null,"-To remove all selections in a field, click on the field/cell and press the 'delete' key.","Evidence Based Program/s Used"]
[null,"•","Supervisorial District/s Served"]
[null,"•","Cities and Unincorporated Areas* Served"]
[null,"•","If City of LA, list the communities served"]
[null,"•","Zip Codes Served"]
[null,"•","Priority Substance"]

{"sheet":"Site Locations","index":2,"n_rows":3,"n_cols":10,"rows_kept":3,"cut":false,"hidden":false,"merged":[]}
["Address","City ","Zip Code","SPA","Super-visorial District","Group Served and Topics","Phone Number","Contact E-mail Addresses","Site Type","For Secondary Sites, Has MOU/Agreement Been Established?"]
["1000 ABC Street","Los Angeles",90005,4,1,"Youth and Marijuana Prevention","310-555-5555","abc@agency.com","Primary","No"]
["555 1st Street","Alhambra ",91803,3,1,"Parents and Fentanyl Workshops","626-555-5555","abc@agency.com","Secondary","Yes"]

{"sheet":"Data Validation","index":3,"n_rows":313,"n_cols":25,"rows_kept":313,"cut":false,"hidden":true,"merged":[]}
["Contract Type","SPAs","Supervisorial Districts","Confirming Substances","Priority Substances",null,"Evidence-Based Interventions (Prevention Standards and Practices Manual)",null,"Contractor Name",null,"Contract Number",null,"Area Type","Cities and Unincorporated Areas*",null,"Area Type","Communities within Los Angeles City",null,"Zip Code","Area Name","1st","2nd","3rd","4th","5th"]
["Community Collaboration Program (CCP)","1 - Antelope Valley","1st District","Yes","Alcohol",null,"Active Parenting of Teens: Families in Action",null,"Asian American Drug Abuse Programs, Inc. (AADAP)",null,"PH-002749",null,"Unincorporated Area","Acton*",null,"Los Angeles City","Adams-Normandie",null,90001,"Florence-Firestone, South LA (City of LA), City of Huntington Park",null,"X",null,"X"]
["Prevention Education Program (PEP)","2 - San Fernando Valley","2nd District","No","Marijuana",null,"America on Track",null,"Avalon Carver Community Center",null,"PH-002804",null,"City","Agoura Hills",null,"Los Angeles City","Alsace",null,90002,"Florence-Firestone, Watts (City of LA)",null,"X"]
["Other","3 - San Gabriel Valley","3rd District",null,"Methamphetamine",null,"ATHENA (Athletes Targeting Healthy Exercise & Nutrition Alternatives)",null,"Behavioral Health Services (BHS)",null,"PH-004367",null,"Unincorporated Area","Agua Dulce*",null,"Los Angeles City","Angeles National Forest",null,90003,"South LA (City of LA)",null,"X"]
[null,"4 - Metro","4th District",null,"Rx (incl. Fentanyl)",null,"ATLAS (Athletes Training and Learning to Avoid Steroids)",null,"Behavioral Health Services (BHS) ",null,"PH-004368",null,"City","Alhambra",null,"Los Angeles City","Angelino Heights",null,90004,"Hancock Park/Melrose (City of LA)","X","X","X"]
[null,"5 - West","5th District",null,null,null,"Building Skills",null,"Cambodian Association of America (CAA)",null,"PH-004369",null,"Unincorporated Area","Altadena*",null,"Los Angeles City","Arleta",null,90005,"Koreatown (City of LA)","X","X"]
[null,"6 - South",null,null,null,null,"Climate Schools: Alcohol and Cannabis Course",null,"Change Lanes Youth Support Services",null,"PH-004373",null,"Unincorporated Area","Anaverde*",null,"Los Angeles City","Atwater Village",null,90006,"Pico-Union/Koreatown/Harvard Heights (City of LA)","X","X"]
[null,"7 - East",null,null,null,null,"Communities Mobilizing for Change on Alcohol (CMCA)",null,"Child & Family Center",null,"PH-004375",null,"Unincorporated Area","Angeles National Forest*",null,"Los Angeles City","Baldwin Hills",null,90007,"Exposition Park/University Park/West Adams (City of LA)","X","X"]
[null,"8 - South Bay",null,null,null,null,"Creating Lasting Family Connections (CLFC)/Creating Lasting Connections (CLC)",null,"Children's Hospital Los Angeles (CHLA)",null,"PH-004376",null,"City","Arcadia",null,"Los Angeles City","Bel Air",null,90008,"Baldwin Hills/Leimert Park/Crenshaw (City of LA), Windsor Hills/View Park",null,"X"]
[null,null,null,null,null,null,"Familias Unidas Preventive Intervention",null,"Community Coalition for Substance Abuse & Treatment (CoCo)",null,"PH-004377",null,"Unincorporated Area","Arcadia Unincorporated*",null,"Los Angeles City","Beverly Crest",null,90010,"Koreatown/Little Bangladesh/Wilshire Center (City of LA)",null,"X"]
[null,null,null,null,null,null,"Guiding Good Choices (GGC)",null,"Day One",null,"PH-004381",null,"City","Artesia",null,"Los Angeles City","Beverlywood",null,90011,"Central LA/South Park (City of LA)","X","X"]
[null,null,null,null,null,null,null,null,"Frinday Night Live (FNL)",null,"PH-005150 ",null,"City","Cerritos",null,"Los Angeles City","El Sereno",null,90033,"Boyle Heights/Wholesale District (City of LA)","X"]
[null,null,null,null,null,null,"I Can Problem Solve (ICPS)",null,"HealthRIGHT 360 - Prototypes",null,"PH-004383",null,"Unincorporated Area","Athens Village*",null,"Los Angeles City","Boyle Heights",null,90012,"Downtown/Chinatown/Little Tokyo/Elysian Park (City of LA)","X"]
[null,null,null,null,null,null,"Keep A Clear Mind (KACM)",null,"Helpline Youth Counseling (HYC)",null,"PH-004388",null,"Unincorporated Area","Athens-Westmont*",null,"Los Angeles City","Brentwood",null,90013,"Downtown/Little Tokyo/Wholesale District (City of LA)","X"]
[null,null,null,null,null,null,"Keepin' it REAL",null,"Institute for Public Strategies (IPS)",null,"PH-004389",null,"City","Avalon",null,"Los Angeles City","Brookside",null,90014,"Downtown/Wholesale District (City of LA)","X"]
[null,null,null,null,null,null,"LifeSkills Training (LST)*",null,"Korean American Family Services, Inc.",null,"PH-004391",null,"Unincorporated Area","Avocado Heights*",null,"Los Angeles City","Cadillac-Corning",null,90015,"Downtown/Pico-Union/Wholesale District (City of LA)","X","X"]
[null,null,null,null,null,null,"Media Ready",null,"Koreatown Youth & Community Center (KYCC)",null,"PH-004393",null,"City","Azusa",null,"Los Angeles City","Canoga Park",null,90016,"Alsace/Baldwin Hills/Crenshaw/Cloverdale-Cochran (City of LA)",null,"X"]
[null,null,null,null,null,null,null,null,"LAC Dept of Parks and Rec ",null,"PH-003942",null,"Unincorporated Area","City Terrace*",null,"Los Angeles City","Elysian Park",null,90034,"Palms/Beverlywood (City of LA)",null,"X","X"]
[null,null,null,null,null,null,"Nurturing Parenting Programs",null,"LAC Office of Education (LACOE)",null,"PH-004394",null,"Unincorporated Area","Azusa Unincorporated*",null,"Los Angeles City","Carthay",null,90017,"Downtown/Westlake (City of LA)","X"]
[null,null,null,null,null,null,"Positive Action",null,"NCADD-East San Gabriel & Pomona Valleys (ESGPV)",null,"PH-004396",null,"City","Baldwin Park",null,"Los Angeles City","Central",null,90018,"West Adams/Jefferson Park/Exposition Park (City of LA)",null,"X"]
[null,null,null,null,null,null,"Prevention through Alternative Learning Styles (PALS)",null,"NCADD-San Fernando Valley (SFV)",null,"PH-004398",null,"Unincorporated Area","Bassett*",null,"Los Angeles City","Century City",null,90019,"Mid City/Miracle Mile/Country Club Park/Victoria Park (City of LA)",null,"X"]
[null,null,null,null,null,null,"Project Alert",null,"Pacific Clinics",null,"PH-004399",null,"City","Bell",null,"Los Angeles City","Century Palms/Cove",null,90020,"Hancock Park/Little Bangladesh/Wilshire Center (City of LA)","X","X"]
[null,null,null,null,null,null,"Project MAGIC (Making A Group and Individual Commitment)",null,"Parents Anonymous, Inc.",null,"PH-004400",null,"City","Bell Gardens",null,"Los Angeles City","Cheviot Hills",null,90021,"Wholesale District/Arts District (City of LA)","X"]
[null,null,null,null,null,null,"Project Northland",null,"People Coordinated Services (PCS)",null,"PH-004401",null,"City","Bellflower",null,"Los Angeles City","Chinatown",null,90022,"East Los Angeles, City of Commerce","X",null,null,"X"]
[null,null,null,null,null,null,"Project Towards No Drug Abuse",null,"Phoenix Houses of Los Angeles, Inc.",null,"PH-004402",null,"City","Beverly Hills",null,"Los Angeles City","Cloverdale/Cochran",null,90023,"East Los Angeles, Boyle Heights (City of LA)","X",null,null,"X"]
[null,null,null,null,null,null,"SAFEChildren",null,"Pueblo Y Salud",null,"PH-004403",null,"Unincorporated Area","Bouquet Canyon*",null,"Los Angeles City","Country Club Park",null,90024,"Westwood (City of LA)",null,null,"X"]
[null,null,null,null,null,null,"Say It Straight (SIS)",null,"Social Model Recovery Systems (SMRS)",null,"PH-004404",null,"City","Bradbury",null,"Los Angeles City","Crenshaw District",null,90025,"Sawtelle/West Los Angeles/Century City (City of LA)",null,null,"X"]
[null,null,null,null,null,null,"Storytelling for Empowerment",null,"South Central Prevention Coalition (SCPC)",null,"PH-004407",null,"Unincorporated Area","Bradbury*",null,"Los Angeles City","Crestview",null,90026,"Echo Park/Silverlake/Historic Filipinotown/Angelino Heights (City of LA)","X"]
[null,null,null,null,null,null,"Strengthening Families Program (SPF)*",null,"Special Services for Groups",null,"PH-004408",null,"City","Burbank",null,"Los Angeles City","Del Rey",null,90027,"Los Feliz/Silverlake/Thai Town (City of LA)","X",null,"X",null,"X"]
[null,null,null,null,null,null,"Strengthening Families Program: For Parents and Youth 10-14",null,"Tarzana Treatment Centers (TTC)",null,"PH-004409",null,"City","Calabasas",null,"Los Angeles City","Downtown",null,90028,"Hollywood (City of LA)",null,null,"X",null,"X"]
[null,null,null,null,null,null,"Strong African American Families (SAAF)",null,"The Wall Las Memorias Project (TWLMP)",null,"PH-004412",null,"Unincorporated Area","Canyon Country Unincorporated*",null,"Los Angeles City","Eagle Rock",null,90029,"East Hollywood/Little Armenia/Silverlake/Melrose (City of LA)","X",null,"X"]
[null,null,null,null,null,null,null,null,"Watts Healthcare Corporation",null,"PH-004413",null,"City","Carson",null,"Los Angeles City","East Hollywood",null,90031,"Lincoln Heights/Elysian Valley/Montecito Heights (City of LA)","X"]
[null,null,null,null,null,null,null,null,null,null,"PH-004416",null,"Unincorporated Area","Castaic*",null,"Los Angeles City","Echo Park",null,90032,"El Sereno/Cal State University LA/Monterey Hills (City of LA)","X",null,null,null,"X"]
[null,null,null,null,null,null,null,null,null,null,null,null,"City","Claremont",null,"Los Angeles City","Elysian Valley",null,90035,"Crestview/South Carthay/Beverlywood (City of LA)",null,"X","X"]
[null,null,null,null,null,null,null,null,null,null,null,null,"City","Commerce, City of",null,"Los Angeles City","Encino",null,90036,"Melrose/Park La Brea/Miracle Mile/Hancock Park (City of LA)",null,"X","X"]
[null,null,null,null,null,null,null,null,null,null,null,null,"City","Compton",null,"Los Angeles City","Exposition",null,90037,"South LA/Exposition Park/South Park (City of LA)",null,"X"]
[null,null,null,null,null,null,null,null,null,null,null,null,"City","Covina",null,"Los Angeles City","Exposition Park",null,90038,"Melrose/Hollywood (City of LA)",null,null,"X"]
[null,null,null,null,null,null,null,null,null,null,null,null,"Unincorporated Area","Covina (Charter Oak)*",null,"Los Angeles City","Faircrest Heights",null,90039,"Atwater Village/Silverlake/Echo Park (City of LA)","X",null,null,null,"X"]
[null,null,null,null,null,null,null,null,null,null,null,null,"Unincorporated Area","Covina Unincorporated*",null,"Los Angeles City","Figueroa Park Square",null,90040,"City of Commerce","X",null,null,"X"]
[null,null,null,null,null,null,null,null,null,null,null,null,"City","Cudahy",null,"Los Angeles City","Florence-Firestone",null,90041,"Eagle Rock (City of LA)","X",null,null,null,"X"]
[null,null,null,null,null,null,null,null,null,null,null,null,"City","Culver City",null,"Los Angeles City","Glassell Park",null,90042,"Highland Park/Eagle Rock (City of LA)","X",null,null,null,"X"]
[null,null,null,null,null,null,null,null,null,null,null,null,"Unincorporated Area","Del Sur*",null,"Los Angeles City","Gramercy Place",null,90043,"View Park/Windsor Hills, Hyde Park/Leimert Park (City of LA)",null,"X"]
[null,null,null,null,null,null,null,null,null,null,null,null,"Unincorporated Area","Desert View Highlands*",null,"Los Angeles City","Granada Hills",null,90044,"Athens-Westmont, South LA/Harvard Heights (City of LA)",null,"X"]
[null,null,null,null,null,null,null,null,null,null,null,null,"City","Diamond Bar",null,"Los Angeles City","Green Meadows",null,90045,"Westchester/LAX (City of LA)",null,"X"]
[null,null,null,null,null,null,null,null,null,null,null,null,"City","Downey",null,"Los Angeles City","Hancock Park",null,90046,"City of West Hollywood, Hollywood/Hollywood Hills/Fairfax/Melrose (City of LA)",null,null,"X",null,"X"]
[null,null,null,null,null,null,null,null,null,null,null,null,"City","Duarte",null,"Los Angeles City","Harbor City",null,90047,"Athens-Westmont, South LA/Harvard Heights/Manchester Square (City of LA)",null,"X"]
[null,null,null,null,null,null,null,null,null,null,null,null,"Unincorporated Area","Duarte Unincorporated*",null,"Los Angeles City","Harbor Gateway",null,90048,"Fairfax/Carthay/Beverly (City of LA), City of West Hollywood",null,"X","X"]
[null,null,null,null,null,null,null,null,null,null,null,null,"Unincorporated Area","East La Mirada*",null,"Los Angeles City","Harbor Pines",null,90049,"Bel Air/Brentwood/Westwood (City of LA)",null,null,"X"]
[null,null,null,null,null,null,null,null,null,null,null,null,"Unincorporated Area","East Los Angeles*",null,"Los Angeles City","Harvard Heights",null,90056,"Ladera Heights",null,"X"]
[null,null,null,null,null,null,null,null,null,null,null,null,"Unincorporated Area","East Rancho Dominguez*",null,"Los Angeles City","Harvard Park",null,90057,"Westlake/Temple-Beaudry (City of LA)","X","X"]
[null,null,null,null,null,null,null,null,null,null,null,null,"Unincorporated Area","East Whittier*",null,"Los Angeles City","Highland Park",null,90058,"City of Vernon, Central LA (City of LA), Bandini Islands","X","X",null,"X"]
[null,null,null,null,null,null,null,null,null,null,null,null,"City","El Monte",null,"Los Angeles City","Historic Filipinotown",null,90059,"Watts (City of LA), Willowbrook, City of Compton",null,"X",null,"X"]
[null,null,null,null,null,null,null,null,null,null,null,null,"City","El Segundo",null,"Los Angeles City","Hollywood",null,90061,"Willowbrook, Athens Village, South LA (City of LA)",null,"X"]
[null,null,null,null,null,null,null,null,null,null,null,null,"Unincorporated Area","Florence-Firestone*",null,"Los Angeles City","Hollywood Hills",null,90062,"Exposition Park/South LA (City of LA)",null,"X"]
[null,null,null,null,null,null,null,null,null,null,null,null,"City","Gardena",null,"Los Angeles City","Hyde Park",null,90063,"East Los Angeles, Boyle Heights (City of LA)","X"]
[null,null,null,null,null,null,null,null,null,null,null,null,"City","Glendale",null,"Los Angeles City","Jefferson Park",null,90064,"Cheviot Hills/Rancho Park/Century City/Mar Vista (City of LA)",null,null,"X"]
[null,null,null,null,null,null,null,null,null,null,null,null,"City","Glendora",null,"Los Angeles City","Koreatown",null,90065,"Glassell Park/Mt. Washington/Cypress Park (City of LA)","X",null,null,null,"X"]
[null,null,null,null,null,null,null,null,null,null,null,null,"Unincorporated Area","Gorman*",null,"Los Angeles City","Lafayette Square",null,90066,"Mar Vista/Del Rey/Playa Vista (City of LA), City of Culver City",null,"X","X"]
[null,null,null,null,null,null,null,null,null,null,null,null,"Unincorporated Area","Hacienda Heights*",null,"Los Angeles City","Lake Balboa",null,90067,"Century City (City of LA)",null,null,"X"]
[null,null,null,null,null,null,null,null,null,null,null,null,"City","Hawaiian Gardens",null,"Los Angeles City","Lakeview Terrace",null,90068,"Hollywood Hills/Los Feliz (City of LA)",null,null,"X",null,"X"]
[null,null,null,null,null,null,null,null,null,null,null,null,"City","Hawthorne",null,"Los Angeles City","Leimert Park",null,90069,"City of West Hollywood, Hollywood (City of LA)",null,null,"X"]
[null,null,null,null,null,null,null,null,null,null,null,null,"City","Hermosa Beach",null,"Los Angeles City","Lincoln Heights",null,90071,"Downtown (City of LA)","X"]
[null,null,null,null,null,null,null,null,null,null,null,null,"City","Hidden Hills",null,"Los Angeles City","Little Armenia",null,90073,"VA Hospital (Unincorporated)",null,null,"X"]
[null,null,null,null,null,null,null,null,null,null,null,null,"City","Huntington Park",null,"Los Angeles City","Little Bangladesh",null,90077,"Bel Air/Beverly Crest (City of LA)",null,null,"X"]
[null,null,null,null,null,null,null,null,null,null,null,null,"City","Industry, City of",null,"Los Angeles City","Little Tokyo",null,90089,"USC (City of LA)",null,"X"]
[null,null,null,null,null,null,null,null,null,null,null,null,"City","Inglewood",null,"Los Angeles City","Longwood",null,90090,"Dodger Stadium (City of LA)","X"]
[null,null,null,null,null,null,null,null,null,null,null,null,"City","Irwindale",null,"Los Angeles City","Los Feliz",null,90094,"Playa Vista/Playa Del Rey (City of LA)",null,"X"]
[null,null,null,null,null,null,null,null,null,null,null,null,"Unincorporated Area","Kagel/Lopez Canyons*",null,"Los Angeles City","Manchester Square",null,90095,"UCLA (City of LA)",null,null,"X"]
[null,null,null,null,null,null,null,null,null,null,null,null,"City","La Cañada Flintridge",null,"Los Angeles City","Mandeville Canyon",null,90201,"City of Bell, City of Bell Gardens, City of Cudahy",null,null,null,"X"]
[null,null,null,null,null,null,null,null,null,null,null,null,"Unincorporated Area","La Crescenta-Montrose*",null,"Los Angeles City","Mar Vista",null,90210,"City of Beverly Hills/Beverly Crest (City of LA)",null,null,"X"]
[null,null,null,null,null,null,null,null,null,null,null,null,"City","La Habra Heights",null,"Los Angeles City","Marina Peninsula",null,90211,"City of Beverly Hills",null,null,"X"]
[null,null,null,null,null,null,null,null,null,null,null,null,"City","La Mirada",null,"Los Angeles City","Melrose",null,90212,"City of Beverly Hills",null,null,"X"]
[null,null,null,null,null,null,null,null,null,null,null,null,"City","La Puente",null,"Los Angeles City","Mid-City",null,90220,"City of Compton, West Rancho Dominguez",null,"X"]
[null,null,null,null,null,null,null,null,null,null,null,null,"Unincorporated Area","La Rambla*",null,"Los Angeles City","Miracle Mile",null,90221,"City of Compton, East Rancho Dominguez",null,"X",null,"X"]
[null,null,null,null,null,null,null,null,null,null,null,null,"City","La Verne",null,"Los Angeles City","Mission Hills",null,90222,"City of Compton, Rosewood, Willowbrook",null,"X",null,"X"]
[null,null,null,null,null,null,null,null,null,null,null,null,"Unincorporated Area","La Verne Unincorporated*",null,"Los Angeles City","Mt. Washington",null,90230,"City of Culver City, Ladera Heights, Playa Vista/Del Rey (City of LA)",null,"X"]
[null,null,null,null,null,null,null,null,null,null,null,null,"Unincorporated Area","Ladera Heights*",null,"Los Angeles City","North Hollywood",null,90232,"City of Culver City, Palms (City of LA)",null,"X","X"]
[null,null,null,null,null,null,null,null,null,null,null,null,"Unincorporated Area","Lake Hughes*",null,"Los Angeles City","Northridge",null,90240,"City of Downey",null,null,null,"X"]
[null,null,null,null,null,null,null,null,null,null,null,null,"Unincorporated Area","Lake Los Angeles*",null,"Los Angeles City","Pacific Palisades",null,90241,"City of Downey",null,null,null,"X"]
[null,null,null,null,null,null,null,null,null,null,null,null,"Unincorporated Area","Lake Manor*",null,"Los Angeles City","Pacoima",null,90242,"City of Downey",null,null,null,"X"]
[null,null,null,null,null,null,null,null,null,null,null,null,"City","Lakewood",null,"Los Angeles City","Palisades Highlands",null,90245,"City of El Segundo",null,"X"]
[null,null,null,null,null,null,null,null,null,null,null,null,"City","Lancaster",null,"Los Angeles City","Palms",null,90247,"City of Gardena, Harbor Gateway (City of LA)",null,"X",null,"X"]
[null,null,null,null,null,null,null,null,null,null,null,null,"City","Lawndale",null,"Los Angeles City","Panorama City",null,90248,"City of Gardena, Harbor Gateway (City of LA), City of Carson, Rosewood",null,"X",null,"X"]
[null,null,null,null,null,null,null,null,null,null,null,null,"Unincorporated Area","Lennox*",null,"Los Angeles City","Park La Brea",null,90249,"City of Gardena, El Camino Village",null,"X"]
[null,null,null,null,null,null,null,null,null,null,null,null,"Unincorporated Area","Leona Valley*",null,"Los Angeles City","Pico-Union",null,90250,"City of Hawthorne, Del Aire, Wiseburn, Unincorporated Hawthorne",null,"X"]
[null,null,null,null,null,null,null,null,null,null,null,null,"Unincorporated Area","Littlerock*",null,"Los Angeles City","Playa Del Rey",null,90254,"City of Hermosa Beach",null,"X"]
[null,null,null,null,null,null,null,null,null,null,null,null,"Unincorporated Area","Littlerock/Juniper Hills*",null,"Los Angeles City","Porter Ranch",null,90255,"City of Huntington Park, Walnut Park",null,"X",null,"X"]
[null,null,null,null,null,null,null,null,null,null,null,null,"Unincorporated Area","Littlerock/Pearblossom*",null,"Los Angeles City","Rancho Park",null,90260,"City of Lawndale, El Camino Village, City of Hawthorne",null,"X"]
[null,null,null,null,null,null,null,null,null,null,null,null,"Unincorporated Area","Llano*",null,"Los Angeles City","Regent Square",null,90261,"City of Hawthorne",null,"X"]
[null,null,null,null,null,null,null,null,null,null,null,null,"City","Lomita",null,"Los Angeles City","Reseda",null,90262,"City of Lynwood",null,"X",null,"X"]
[null,null,null,null,null,null,null,null,null,null,null,null,"City","Long Beach",null,"Los Angeles City","Reseda Ranch",null,90263,"Pepperdine University (Unincorporated Santa Monica Mountains)",null,null,"X"]
[null,null,null,null,null,null,null,null,null,null,null,null,"City","Los Angeles",null,"Los Angeles City","Reynier Village",null,90265,"City of Malibu, Santa Monica Mountains",null,null,"X"]
[null,null,null,null,null,null,null,null,null,null,null,null,"Unincorporated Area","Los Nietos*",null,"Los Angeles City","San Pedro",null,90266,"City of Manhattan Beach",null,"X"]
[null,null,null,null,null,null,null,null,null,null,null,null,"City","Lynwood",null,"Los Angeles City","Shadow Hills",null,90270,"City of Maywood",null,null,null,"X"]
[null,null,null,null,null,null,null,null,null,null,null,null,"City","Malibu",null,"Los Angeles City","Sherman Oaks",null,90272,"Pacific Palisades/Palisades Highlands (City of LA)",null,null,"X"]
[null,null,null,null,null,null,null,null,null,null,null,null,"City","Manhattan Beach",null,"Los Angeles City","Silverlake",null,90274,"City of Palos Verdes Estates, City of Rolling Hills, City of Rolling Hills Estates, Westfield/Academy Hills",null,null,null,"X"]
[null,null,null,null,null,null,null,null,null,null,null,null,"Unincorporated Area","Marina del Rey*",null,"Los Angeles City","South Carthay",null,90275,"City of Rancho Palos Verdes",null,null,null,"X"]
[null,null,null,null,null,null,null,null,null,null,null,null,"City","Maywood",null,"Los Angeles City","South Park",null,90277,"City of Redondo Beach, City of Torrance",null,"X",null,"X"]
[null,null,null,null,null,null,null,null,null,null,null,null,"City","Monrovia",null,"Los Angeles City","St. Elmo Village",null,90278,"City of Redondo Beach, City of Torrance",null,"X",null,"X"]
[null,null,null,null,null,null,null,null,null,null,null,null,"Unincorporated Area","Monrovia Unincorporated*",null,"Los Angeles City","Studio City",null,90280,"City of South Gate",null,"X",null,"X"]
[null,null,null,null,null,null,null,null,null,null,null,null,"City","Montebello",null,"Los Angeles City","Sun Valley",null,90290,"Topanga (Santa Monica Mountains)",null,null,"X"]
[null,null,null,null,null,null,null,null,null,null,null,null,"City","Monterey Park",null,"Los Angeles City","Sunland",null,90291,"Venice (City of LA)",null,"X","X"]
[null,null,null,null,null,null,null,null,null,null,null,null,"Unincorporated Area","North Whittier*",null,"Los Angeles City","Sycamore Square",null,90292,"Marina del Rey, Del Rey (City of L A)",null,"X","X"]
[null,null,null,null,null,null,null,null,null,null,null,null,"Unincorporated Area","Northeast San Gabriel*",null,"Los Angeles City","Sylmar",null,90293,"Playa del Rey (City of LA)",null,"X"]
[null,null,null,null,null,null,null,null,null,null,null,null,"City","Norwalk",null,"Los Angeles City","Tarzana",null,90301,"City of Inglewood",null,"X"]
[null,null,null,null,null,null,null,null,null,null,null,null,"City","Palmdale",null,"Los Angeles City","Temple-Beaudry",null,90302,"City of Inglewood",null,"X"]
[null,null,null,null,null,null,null,null,null,null,null,null,"Unincorporated Area","Palmdale Unincorporated*",null,"Los Angeles City","Thai Town",null,90303,"City of Inglewood",null,"X"]
[null,null,null,null,null,null,null,null,null,null,null,null,"City","Palos Verdes Estates",null,"Los Angeles City","Toluca Lake",null,90304,"Lennox, City of Inglewood, City of Hawthorne",null,"X"]
[null,null,null,null,null,null,null,null,null,null,null,null,"City","Paramount",null,"Los Angeles City","Toluca Terrace",null,90305,"City of Inglewood",null,"X"]
[null,null,null,null,null,null,null,null,null,null,null,null,"City","Pasadena",null,"Los Angeles City","Toluca Woods",null,90401,"City of Santa Monica",null,null,"X"]
[null,null,null,null,null,null,null,null,null,null,null,null,"Unincorporated Area","Pearblossom/Llano*",null,"Los Angeles City","Tujunga",null,90402,"City of Santa Monica, Pacific Palisades (City of LA)",null,null,"X"]
[null,null,null,null,null,null,null,null,null,null,null,null,"City","Pico Rivera",null,"Los Angeles City","University Hills",null,90403,"City of Santa Monica",null,null,"X"]
[null,null,null,null,null,null,null,null,null,null,null,null,"City","Pomona",null,"Los Angeles City","University Park",null,90404,"City of Santa Monica",null,null,"X"]
[null,null,null,null,null,null,null,null,null,null,null,null,"Unincorporated Area","Quartz Hill*",null,"Los Angeles City","Valley Glen",null,90405,"City of Santa Monica",null,null,"X"]
[null,null,null,null,null,null,null,null,null,null,null,null,"Unincorporated Area","Rancho Dominguez*",null,"Los Angeles City","Valley Village",null,90501,"City of Torrance, Harbor Gateway (City of LA)",null,"X",null,"X"]
[null,null,null,null,null,null,null,null,null,null,null,null,"City","Rancho Palos Verdes",null,"Los Angeles City","Van Nuys",null,90502,"West Carson, Harbor Gateway (City of LA)",null,"X"]
[null,null,null,null,null,null,null,null,null,null,null,null,"City","Redondo Beach",null,"Los Angeles City","Venice",null,90503,"City of Torrance",null,null,null,"X"]
[null,null,null,null,null,null,null,null,null,null,null,null,"City","Rolling Hills",null,"Los Angeles City","Vermont Knolls",null,90504,"City of Torrance",null,"X",null,"X"]
[null,null,null,null,null,null,null,null,null,null,null,null,"City","Rolling Hills Estates",null,"Los Angeles City","Vermont Square",null,90505,"City of Torrance",null,null,null,"X"]
[null,null,null,null,null,null,null,null,null,null,null,null,"City","Rosemead",null,"Los Angeles City","Vermont Vista",null,90506,"El Camino College (Unincorporated El Camino Village)",null,"X"]
[null,null,null,null,null,null,null,null,null,null,null,null,"Unincorporated Area","Rosewood*",null,"Los Angeles City","Vernon Central",null,90601,"City of Whittier, Unincorporated Whittier, City of Industry, City of Pico Rivera, Sunrise Village","X",null,null,"X"]
[null,null,null,null,null,null,null,null,null,null,null,null,"Unincorporated Area","Rosewood/West Rancho Dominguez*",null,"Los Angeles City","Victoria Park",null,90602,"City of Whittier",null,null,null,"X"]
[null,null,null,null,null,null,null,null,null,null,null,null,"Unincorporated Area","Rowland Heights*",null,"Los Angeles City","View Heights",null,90603,"City of Whittier",null,null,null,"X"]
[null,null,null,null,null,null,null,null,null,null,null,null,"City","San Dimas",null,"Los Angeles City","Watts",null,90604,"South Whittier, East Whittier, City of Whittier, East La Mirada",null,null,null,"X"]
[null,null,null,null,null,null,null,null,null,null,null,null,"City","San Fernando",null,"Los Angeles City","Wellington Square",null,90605,"City of Whittier, South Whittier",null,null,null,"X"]
[null,null,null,null,null,null,null,null,null,null,null,null,"City","San Gabriel",null,"Los Angeles City","West Adams",null,90606,"West Whittier/Los Nietos, City of Whittier, City of Santa Fe Springs",null,null,null,"X"]
[null,null,null,null,null,null,null,null,null,null,null,null,"Unincorporated Area","San Jose Hills*",null,"Los Angeles City","West Hills",null,90623,"City of Cerritos",null,null,null,"X"]
[null,null,null,null,null,null,null,null,null,null,null,null,"City","San Marino",null,"Los Angeles City","West Los Angeles",null,90630,"Unincorporated Lakewood",null,null,null,"X"]
[null,null,null,null,null,null,null,null,null,null,null,null,"Unincorporated Area","Santa Catalina Island*",null,"Los Angeles City","West Vernon",null,90631,"City of La Habra Heights, Rowland Heights, Unincorporated La Habra Heights","X",null,null,"X"]
[null,null,null,null,null,null,null,null,null,null,null,null,"City","Santa Clarita",null,"Los Angeles City","Westchester",null,90638,"City of La Mirada",null,null,null,"X"]
[null,null,null,null,null,null,null,null,null,null,null,null,"City","Santa Fe Springs",null,"Los Angeles City","Westlake",null,90639,"Biola University (City of La Mirada)",null,null,null,"X"]
[null,null,null,null,null,null,null,null,null,null,null,null,"City","Santa Monica",null,"Los Angeles City","Westwood",null,90640,"City of Montebello","X",null,null,"X"]
[null,null,null,null,null,null,null,null,null,null,null,null,"Unincorporated Area","Santa Monica Mountains*",null,"Los Angeles City","Wilmington",null,90650,"City of Norwalk",null,null,null,"X"]
[null,null,null,null,null,null,null,null,null,null,null,null,"Unincorporated Area","Saugus Unincorporated*",null,"Los Angeles City","Wilshire Center",null,90660,"City of Pico Rivera, Whittier Narrows","X",null,null,"X"]
[null,null,null,null,null,null,null,null,null,null,null,null,"City","Sierra Madre",null,"Los Angeles City","Winnetka",null,90670,"City of Santa Fe Springs",null,null,null,"X"]
[null,null,null,null,null,null,null,null,null,null,null,null,"City","Signal Hill",null,"Los Angeles City","Woodland Hills",null,90701,"City of Artesia",null,null,null,"X"]
[null,null,null,null,null,null,null,null,null,null,null,null,"City","Skid Row",null,null,null,null,90703,"City of Cerritos, Unincorporated Cerritos",null,null,null,"X"]
[null,null,null,null,null,null,null,null,null,null,null,null,"Unincorporated Area","South El Monte",null,null,null,null,90704,"City of Avalon, Unincorporated Santa Catalina Island",null,null,null,"X"]
[null,null,null,null,null,null,null,null,null,null,null,null,"City","South El Monte Unincorporated*",null,null,null,null,90706,"City of Bellflower",null,null,null,"X"]
[null,null,null,null,null,null,null,null,null,null,null,null,"City","South Gate",null,null,null,null,90710,"Harbor City (City of LA), West Carson",null,"X",null,"X"]
[null,null,null,null,null,null,null,null,null,null,null,null,"Unincorporated Area","South Pasadena",null,null,null,null,90712,"City of Lakewood",null,null,null,"X"]
[null,null,null,null,null,null,null,null,null,null,null,null,"Unincorporated Area","South San Gabriel*",null,null,null,null,90713,"City of Lakewood",null,null,null,"X"]
[null,null,null,null,null,null,null,null,null,null,null,null,"Unincorporated Area","South Whittier*",null,null,null,null,90715,"City of Lakewood",null,null,null,"X"]
[null,null,null,null,null,null,null,null,null,null,null,null,"Unincorporated Area","Stevenson Ranch*",null,null,null,null,90716,"City of Hawaiian Gardens",null,null,null,"X"]
[null,null,null,null,null,null,null,null,null,null,null,null,"Unincorporated Area","Sun Village*",null,null,null,null,90717,"City of Lomita, Harbor City (City of LA),",null,null,null,"X"]
[null,null,null,null,null,null,null,null,null,null,null,null,"City","Sunrise Village*",null,null,null,null,90723,"City of Paramount",null,"X",null,"X"]
[null,null,null,null,null,null,null,null,null,null,null,null,"City","Temple City",null,null,null,null,90731,"San Pedro/Harbor City/Terminal Island (City of LA), La Rambla",null,null,null,"X"]
[null,null,null,null,null,null,null,null,null,null,null,null,"Unincorporated Area","Torrance",null,null,null,null,90732,"San Pedro/Harbor City (City of LA), La Rambla, City of Rancho Palos Verdes",null,null,null,"X"]
[null,null,null,null,null,null,null,null,null,null,null,null,"Unincorporated Area","Twin Lakes/Oat Mountain*",null,null,null,null,90744,"Wilmington/Harbor City (City of LA)",null,"X",null,"X"]
[null,null,null,null,null,null,null,null,null,null,null,null,"Unincorporated Area","Val Verde*",null,null,null,null,90745,"City of Carson",null,"X",null,"X"]
[null,null,null,null,null,null,null,null,null,null,null,null,"Unincorporated Area","Valencia Unincorporated*",null,null,null,null,90746,"City of Carson",null,"X"]
[null,null,null,null,null,null,null,null,null,null,null,null,"City","Valinda*",null,null,null,null,90747,"Cal State University Dominguez Hills (City of Carson)",null,"X"]
[null,null,null,null,null,null,null,null,null,null,null,null,"Unincorporated Area","Vernon",null,null,null,null,90755,"City of Signal Hill",null,null,null,"X"]
[null,null,null,null,null,null,null,null,null,null,null,null,"City","View Park/Windsor Hills*",null,null,null,null,90802,"City of Long Beach",null,null,null,"X"]
[null,null,null,null,null,null,null,null,null,null,null,null,"Unincorporated Area","Walnut",null,null,null,null,90803,"City of Long Beach",null,null,null,"X"]
[null,null,null,null,null,null,null,null,null,null,null,null,"Unincorporated Area","Walnut Park*",null,null,null,null,90804,"City of Long Beach",null,null,null,"X"]
[null,null,null,null,null,null,null,null,null,null,null,null,"Unincorporated Area","West Antelope Valley*",null,null,null,null,90805,"City of Long Beach",null,"X",null,"X"]
[null,null,null,null,null,null,null,null,null,null,null,null,"City","West Carson*",null,null,null,null,90806,"City of Long Beach",null,null,null,"X"]
[null,null,null,null,null,null,null,null,null,null,null,null,"City","West Covina",null,null,null,null,90807,"City of Long Beach",null,null,null,"X"]
[null,null,null,null,null,null,null,null,null,null,null,null,"Unincorporated Area","West Hollywood",null,null,null,null,90808,"City of Long Beach, Unincorporated Long Beach",null,null,null,"X"]
[null,null,null,null,null,null,null,null,null,null,null,null,"Unincorporated Area","West LA Unincorporated*",null,null,null,null,90810,"City of Long Beach, City of Carson",null,"X",null,"X"]
[null,null,null,null,null,null,null,null,null,null,null,null,"Unincorporated Area","West Puente Valley*",null,null,null,null,90813,"City of Long Beach",null,null,null,"X"]
[null,null,null,null,null,null,null,null,null,null,null,null,"Unincorporated Area","West Rancho Dominguez*",null,null,null,null,90814,"City of Long Beach",null,null,null,"X"]
[null,null,null,null,null,null,null,null,null,null,null,null,"City","West Whittier/Los Nietos*",null,null,null,null,90815,"City of Long Beach",null,null,null,"X"]
[null,null,null,null,null,null,null,null,null,null,null,null,"Unincorporated Area","Westlake Village",null,null,null,null,90822,"VA Medical Center-Long Beach (City of Long Beach)",null,null,null,"X"]
[null,null,null,null,null,null,null,null,null,null,null,null,"City","White Fence Farms*",null,null,null,null,90831,"World Trade Center (City of Long Beach)",null,null,null,"X"]
[null,null,null,null,null,null,null,null,null,null,null,null,"Unincorporated Area","Whittier",null,null,null,null,90840,"Cal State University Long Beach (City of Long Beach)",null,null,null,"X"]
[null,null,null,null,null,null,null,null,null,null,null,null,"Unincorporated Area","Whittier Narrows*",null,null,null,null,90846,"City of Long Beach, City of Lakewood",null,null,null,"X"]
[null,null,null,null,null,null,null,null,null,null,null,null,"Unincorporated Area","Whittier Unincorporated*",null,null,null,null,91001,"Altadena",null,null,null,null,"X"]
[null,null,null,null,null,null,null,null,null,null,null,null,"Unincorporated Area","Willowbrook*",null,null,null,null,91006,"City of Arcadia, Unincorporated Arcadia","X",null,null,null,"X"]
[null,null,null,null,null,null,null,null,null,null,null,null,null,"Wiseburn*",null,null,null,null,91007,"City of Arcadia, Unincorporated NE San Gabriel",null,null,null,null,"X"]
[null,null,null,null,null,null,null,null,null,null,null,null,null,null,null,null,null,null,91008,"City of Bradbury, Unincorporated Bradbury, City of Duarte",null,null,null,null,"X"]
[null,null,null,null,null,null,null,null,null,null,null,null,null,null,null,null,null,null,91010,"City of Duarte, Unincorporated Duarte, City of Azusa, City of Irwindale","X",null,null,null,"X"]
[null,null,null,null,null,null,null,null,null,null,null,null,null,null,null,null,null,null,91011,"City of La Canada-Flintridge, City of Pasadena",null,null,null,null,"X"]
[null,null,null,null,null,null,null,null,null,null,null,null,null,null,null,null,null,null,91016,"City of Monrovia, Unincorporated Monrovia","X",null,null,null,"X"]
[null,null,null,null,null,null,null,null,null,null,null,null,null,null,null,null,null,null,91020,"La Crescenta-Montrose, City of Glendale",null,null,null,null,"X"]
[null,null,null,null,null,null,null,null,null,null,null,null,null,null,null,null,null,null,91023,"Mount Wilson (Angeles National Forest)",null,null,null,null,"X"]
[null,null,null,null,null,null,null,null,null,null,null,null,null,null,null,null,null,null,91024,"City of Sierra Madre",null,null,null,null,"X"]
[null,null,null,null,null,null,null,null,null,null,null,null,null,null,null,null,null,null,91030,"City of South Pasadena","X",null,null,null,"X"]
[null,null,null,null,null,null,null,null,null,null,null,null,null,null,null,null,null,null,91040,"Shadow Hills/Sunland/Hansen Dam (City of LA)",null,null,"X",null,"X"]
[null,null,null,null,null,null,null,null,null,null,null,null,null,null,null,null,null,null,91042,"Tujunga (City of LA), Angeles National Forest",null,null,null,null,"X"]
[null,null,null,null,null,null,null,null,null,null,null,null,null,null,null,null,null,null,91046,"City of Glendale (Verdugo City)",null,null,null,null,"X"]
[null,null,null,null,null,null,null,null,null,null,null,null,null,null,null,null,null,null,91101,"City of Pasadena",null,null,null,null,"X"]
[null,null,null,null,null,null,null,null,null,null,null,null,null,null,null,null,null,null,91103,"City of Pasadena",null,null,null,null,"X"]
[null,null,null,null,null,null,null,null,null,null,null,null,null,null,null,null,null,null,91104,"City of Pasadena, Altadena",null,null,null,null,"X"]
[null,null,null,null,null,null,null,null,null,null,null,null,null,null,null,null,null,null,91105,"City of Pasadena","X",null,null,null,"X"]
[null,null,null,null,null,null,null,null,null,null,null,null,null,null,null,null,null,null,91106,"City of Pasadena",null,null,null,null,"X"]
[null,null,null,null,null,null,null,null,null,null,null,null,null,null,null,null,null,null,91107,"City of Pasadena, Unincorporated East Pasadena, San Pasqual, Kinneloa Mesa",null,null,null,null,"X"]
[null,null,null,null,null,null,null,null,null,null,null,null,null,null,null,null,null,null,91108,"City of San Marino",null,null,null,null,"X"]
[null,null,null,null,null,null,null,null,null,null,null,null,null,null,null,null,null,null,91125,"California Institute of Technology (City of Pasadena)",null,null,null,null,"X"]
[null,null,null,null,null,null,null,null,null,null,null,null,null,null,null,null,null,null,91126,"California Institute of Technology (City of Pasadena)",null,null,null,null,"X"]
[null,null,null,null,null,null,null,null,null,null,null,null,null,null,null,null,null,null,91201,"City of Glendale",null,null,null,null,"X"]
[null,null,null,null,null,null,null,null,null,null,null,null,null,null,null,null,null,null,91202,"City of Glendale",null,null,null,null,"X"]
[null,null,null,null,null,null,null,null,null,null,null,null,null,null,null,null,null,null,91203,"City of Glendale",null,null,null,null,"X"]
[null,null,null,null,null,null,null,null,null,null,null,null,null,null,null,null,null,null,91204,"City of Glendale","X",null,null,null,"X"]
[null,null,null,null,null,null,null,null,null,null,null,null,null,null,null,null,null,null,91205,"City of Glendale, Glassell Park (City of LA)","X",null,null,null,"X"]
[null,null,null,null,null,null,null,null,null,null,null,null,null,null,null,null,null,null,91206,"City of Glendale","X",null,null,null,"X"]
[null,null,null,null,null,null,null,null,null,null,null,null,null,null,null,null,null,null,91207,"City of Glendale",null,null,null,null,"X"]
[null,null,null,null,null,null,null,null,null,null,null,null,null,null,null,null,null,null,91208,"City of Glendale",null,null,null,null,"X"]
[null,null,null,null,null,null,null,null,null,null,null,null,null,null,null,null,null,null,91210,"Glendale Galleria (City of Glendale)",null,null,null,null,"X"]
[null,null,null,null,null,null,null,null,null,null,null,null,null,null,null,null,null,null,91214,"La Crescenta-Montrose, City of Glendale",null,null,null,null,"X"]
[null,null,null,null,null,null,null,null,null,null,null,null,null,null,null,null,null,null,91301,"City of Agoura Hills, Santa Monica Mountains",null,null,"X"]
[null,null,null,null,null,null,null,null,null,null,null,null,null,null,null,null,null,null,91302,"City of Calabasas, City of Hidden Hills, Santa Monica Mountains",null,null,"X"]
[null,null,null,null,null,null,null,null,null,null,null,null,null,null,null,null,null,null,91303,"Canoga Park (City of LA)",null,null,"X"]
[null,null,null,null,null,null,null,null,null,null,null,null,null,null,null,null,null,null,91304,"Canoga Park/West Hills (City of LA), West Chatsworth, Lake Manor",null,null,"X"]
[null,null,null,null,null,null,null,null,null,null,null,null,null,null,null,null,null,null,91306,"Winnetka (City of LA)",null,null,"X"]
[null,null,null,null,null,null,null,null,null,null,null,null,null,null,null,null,null,null,91307,"West Hills (City of LA), Unincorporated Westhills",null,null,"X"]
[null,null,null,null,null,null,null,null,null,null,null,null,null,null,null,null,null,null,91311,"Chatsworth (City of LA), Twin Lakes, Oat Mountain",null,null,"X",null,"X"]
[null,null,null,null,null,null,null,null,null,null,null,null,null,null,null,null,null,null,91316,"Encino (City of LA)",null,null,"X"]
[null,null,null,null,null,null,null,null,null,null,null,null,null,null,null,null,null,null,91321,"City of Santa Clarita, Unincorporated Newhall, Placerita Canyon, Angeles National Forest",null,null,null,null,"X"]
[null,null,null,null,null,null,null,null,null,null,null,null,null,null,null,null,null,null,91324,"Northridge (City of LA)",null,null,"X"]
[null,null,null,null,null,null,null,null,null,null,null,null,null,null,null,null,null,null,91325,"Northridge (City of LA)",null,null,"X"]
[null,null,null,null,null,null,null,null,null,null,null,null,null,null,null,null,null,null,91326,"Porter Ranch (City of LA), Twin Lakes, Oat Mountain",null,null,"X",null,"X"]
[null,null,null,null,null,null,null,null,null,null,null,null,null,null,null,null,null,null,91330,"California State University Northridge (City of LA)",null,null,"X"]
[null,null,null,null,null,null,null,null,null,null,null,null,null,null,null,null,null,null,91331,"Arleta/Pacoima (City of LA)",null,null,"X",null,"X"]
[null,null,null,null,null,null,null,null,null,null,null,null,null,null,null,null,null,null,91335,"Reseda (City of LA)",null,null,"X"]
[null,null,null,null,null,null,null,null,null,null,null,null,null,null,null,null,null,null,91340,"City of San Fernando, Mission Hills/Pacoima (City of LA)",null,null,"X"]
[null,null,null,null,null,null,null,null,null,null,null,null,null,null,null,null,null,null,91342,"Lake View Terrace/Sylmar (City of LA), Kagel Canyon, Lopez Canyon",null,null,"X",null,"X"]
[null,null,null,null,null,null,null,null,null,null,null,null,null,null,null,null,null,null,91343,"North Hills/Northridge (City of LA)",null,null,"X"]
[null,null,null,null,null,null,null,null,null,null,null,null,null,null,null,null,null,null,91344,"Granada Hills (City of LA)",null,null,"X"]
[null,null,null,null,null,null,null,null,null,null,null,null,null,null,null,null,null,null,91345,"Mission Hills (City of LA)",null,null,"X"]
[null,null,null,null,null,null,null,null,null,null,null,null,null,null,null,null,null,null,91350,"City of Santa Clarita",null,null,null,null,"X"]
[null,null,null,null,null,null,null,null,null,null,null,null,null,null,null,null,null,null,91351,"City of Santa Clarita",null,null,null,null,"X"]
[null,null,null,null,null,null,null,null,null,null,null,null,null,null,null,null,null,null,91352,"Sun Valley (City of LA)",null,null,"X",null,"X"]
[null,null,null,null,null,null,null,null,null,null,null,null,null,null,null,null,null,null,91354,"City of Santa Clarita, Unincorporated Santa Clarita Valley",null,null,null,null,"X"]
[null,null,null,null,null,null,null,null,null,null,null,null,null,null,null,null,null,null,91355,"City of Santa Clarita, Stevenson Ranch, Val Verde",null,null,null,null,"X"]
[null,null,null,null,null,null,null,null,null,null,null,null,null,null,null,null,null,null,91356,"Tarzana/Encino (City of LA)",null,null,"X"]
[null,null,null,null,null,null,null,null,null,null,null,null,null,null,null,null,null,null,91361,"City of Westlake Village, Santa Monica Mountains",null,null,"X"]
[null,null,null,null,null,null,null,null,null,null,null,null,null,null,null,null,null,null,91362,"City of Westlake Village",null,null,"X"]
[null,null,null,null,null,null,null,null,null,null,null,null,null,null,null,null,null,null,91364,"Woodland Hills (City of LA), Santa Monica Mountains",null,null,"X"]
[null,null,null,null,null,null,null,null,null,null,null,null,null,null,null,null,null,null,91367,"Woodland Hills (City of LA)",null,null,"X"]
[null,null,null,null,null,null,null,null,null,null,null,null,null,null,null,null,null,null,91381,"Stevenson Ranch",null,null,null,null,"X"]
[null,null,null,null,null,null,null,null,null,null,null,null,null,null,null,null,null,null,91382,"Unincorporated Santa Clarita Valley, Twin Lakes, Oat Mountain",null,null,null,null,"X"]
[null,null,null,null,null,null,null,null,null,null,null,null,null,null,null,null,null,null,91384,"Castaic, Val Verde",null,null,null,null,"X"]
[null,null,null,null,null,null,null,null,null,null,null,null,null,null,null,null,null,null,91387,"City of Santa Clarita, Unincorporated Santa Clarita Valley, Agua Dulce, Angeles National Forest",null,null,null,null,"X"]
[null,null,null,null,null,null,null,null,null,null,null,null,null,null,null,null,null,null,91390,"Acton, Agua Dulce, City of Santa Clarita, Boquet Canyon, San Francisquito Canyon,",null,null,null,null,"X"]
[null,null,null,null,null,null,null,null,null,null,null,null,null,null,null,null,null,null,91401,"Valley Glen/Sherman Oaks/Van Nuys (City of LA)",null,null,"X"]
[null,null,null,null,null,null,null,null,null,null,null,null,null,null,null,null,null,null,91402,"Panorama City (City of LA)",null,null,"X"]
[null,null,null,null,null,null,null,null,null,null,null,null,null,null,null,null,null,null,91403,"Sherman Oaks/Encino (City of LA)",null,null,"X"]
[null,null,null,null,null,null,null,null,null,null,null,null,null,null,null,null,null,null,91405,"Van Nuys (City of LA)",null,null,"X"]
[null,null,null,null,null,null,null,null,null,null,null,null,null,null,null,null,null,null,91406,"Van Nuys/Lake Balboa (City of LA)",null,null,"X"]
[null,null,null,null,null,null,null,null,null,null,null,null,null,null,null,null,null,null,91411,"Van Nuys/Sherman Oaks (City of LA)",null,null,"X"]
[null,null,null,null,null,null,null,null,null,null,null,null,null,null,null,null,null,null,91423,"Sherman Oaks (City of LA)",null,null,"X"]
[null,null,null,null,null,null,null,null,null,null,null,null,null,null,null,null,null,null,91436,"Encino (City of LA)",null,null,"X"]
[null,null,null,null,null,null,null,null,null,null,null,null,null,null,null,null,null,null,91501,"City of Burbank",null,null,null,null,"X"]
[null,null,null,null,null,null,null,null,null,null,null,null,null,null,null,null,null,null,91502,"City of Burbank",null,null,null,null,"X"]
[null,null,null,null,null,null,null,null,null,null,null,null,null,null,null,null,null,null,91504,"City of Burbank, Sun Valley (City of LA)",null,null,null,null,"X"]
[null,null,null,null,null,null,null,null,null,null,null,null,null,null,null,null,null,null,91505,"City of Burbank",null,null,"X",null,"X"]
[null,null,null,null,null,null,null,null,null,null,null,null,null,null,null,null,null,null,91506,"City of Burbank",null,null,null,null,"X"]
[null,null,null,null,null,null,null,null,null,null,null,null,null,null,null,null,null,null,91521,"City of Burbank (Disney Studios)",null,null,null,null,"X"]
[null,null,null,null,null,null,null,null,null,null,null,null,null,null,null,null,null,null,91522,"City of Burbank (Warner Brothers Studios)",null,null,null,null,"X"]
[null,null,null,null,null,null,null,null,null,null,null,null,null,null,null,null,null,null,91523,"City of Burbank",null,null,null,null,"X"]
[null,null,null,null,null,null,null,null,null,null,null,null,null,null,null,null,null,null,91601,"North Hollywood/Toluca Terrace/Toluca Woods/Valley Village (City of LA)",null,null,null,null,"X"]
[null,null,null,null,null,null,null,null,null,null,null,null,null,null,null,null,null,null,91602,"North Hollywood/Toluca Lake/Studio City (City of LA)",null,null,null,null,"X"]
[null,null,null,null,null,null,null,null,null,null,null,null,null,null,null,null,null,null,91604,"Studio City/Sherman Oaks (City of LA)",null,null,"X",null,"X"]
[null,null,null,null,null,null,null,null,null,null,null,null,null,null,null,null,null,null,91605,"North Hollywood (City of LA)",null,null,"X",null,"X"]
[null,null,null,null,null,null,null,null,null,null,null,null,null,null,null,null,null,null,91606,"North Hollywood (City of LA)",null,null,"X",null,"X"]
[null,null,null,null,null,null,null,null,null,null,null,null,null,null,null,null,null,null,91607,"North Hollywood/Valley Village/Sherman Oaks (City of LA)",null,null,"X",null,"X"]
[null,null,null,null,null,null,null,null,null,null,null,null,null,null,null,null,null,null,91608,"Universal City",null,null,null,null,"X"]
[null,null,null,null,null,null,null,null,null,null,null,null,null,null,null,null,null,null,91702,"City of Azusa, Unincorporated Azusa, Angeles National Forest","X",null,null,null,"X"]
[null,null,null,null,null,null,null,null,null,null,null,null,null,null,null,null,null,null,91706,"City of Baldwin Park, City of Irwindale","X",null,null,null,"X"]
[null,null,null,null,null,null,null,null,null,null,null,null,null,null,null,null,null,null,91709,"City of Pomona","X"]
[null,null,null,null,null,null,null,null,null,null,null,null,null,null,null,null,null,null,91710,"City of Pomona","X"]
[null,null,null,null,null,null,null,null,null,null,null,null,null,null,null,null,null,null,91711,"City of Claremont, Unincorporated Claremont, Padua Hills, Unincorporated La Verne","X",null,null,null,"X"]
[null,null,null,null,null,null,null,null,null,null,null,null,null,null,null,null,null,null,91722,"City of Covina, Unincorporated Covina, Charter Oak","X",null,null,null,"X"]
[null,null,null,null,null,null,null,null,null,null,null,null,null,null,null,null,null,null,91723,"City of Covina, Unincorporated Covina","X"]
[null,null,null,null,null,null,null,null,null,null,null,null,null,null,null,null,null,null,91724,"City of Covina, Unincorporated Covina, Charter Oak","X",null,null,null,"X"]
[null,null,null,null,null,null,null,null,null,null,null,null,null,null,null,null,null,null,91731,"City of El Monte","X",null,null,null,"X"]
[null,null,null,null,null,null,null,null,null,null,null,null,null,null,null,null,null,null,91732,"City of El Monte","X"]
[null,null,null,null,null,null,null,null,null,null,null,null,null,null,null,null,null,null,91733,"City of South El Monte, City of El Monte, Whittier Narrows","X"]
[null,null,null,null,null,null,null,null,null,null,null,null,null,null,null,null,null,null,91740,"City of Glendora, Unincorporated Glendora","X",null,null,null,"X"]
[null,null,null,null,null,null,null,null,null,null,null,null,null,null,null,null,null,null,91741,"City of Glendora, City of San Dimas, Angeles National Forest",null,null,null,null,"X"]
[null,null,null,null,null,null,null,null,null,null,null,null,null,null,null,null,null,null,91744,"City of La Puente, Valinda, San Jose Hills, City of Industry, West Puente Valley","X"]
[null,null,null,null,null,null,null,null,null,null,null,null,null,null,null,null,null,null,91745,"Hacienda Heights, City of Industry","X",null,null,"X"]
[null,null,null,null,null,null,null,null,null,null,null,null,null,null,null,null,null,null,91746,"Avocado Heights, Bassett, City of Industry, City of La Puente, North Whittier","X"]
[null,null,null,null,null,null,null,null,null,null,null,null,null,null,null,null,null,null,91748,"Rowland Heights, City of Industry","X"]
[null,null,null,null,null,null,null,null,null,null,null,null,null,null,null,null,null,null,91750,"City of La Verne, Unincorporated La Verne, Angeles National Forest","X",null,null,null,"X"]
[null,null,null,null,null,null,null,null,null,null,null,null,null,null,null,null,null,null,91754,"City of Monterey Park","X"]
[null,null,null,null,null,null,null,null,null,null,null,null,null,null,null,null,null,null,91755,"City of Monterey Park","X"]
[null,null,null,null,null,null,null,null,null,null,null,null,null,null,null,null,null,null,91759,"Unincorporated Mt. Baldy, Angeles National Forest",null,null,null,null,"X"]
[null,null,null,null,null,null,null,null,null,null,null,null,null,null,null,null,null,null,91765,"City of Diamond Bar","X"]
[null,null,null,null,null,null,null,null,null,null,null,null,null,null,null,null,null,null,91766,"City of Pomona","X"]
[null,null,null,null,null,null,null,null,null,null,null,null,null,null,null,null,null,null,91767,"City of Pomona","X",null,null,null,"X"]
[null,null,null,null,null,null,null,null,null,null,null,null,null,null,null,null,null,null,91768,"City of Pomona, Unincorporated Pomona (Cal Poly Pomona)","X",null,null,null,"X"]
[null,null,null,null,null,null,null,null,null,null,null,null,null,null,null,null,null,null,91770,"City of Rosemead, South San Gabriel","X",null,null,null,"X"]
[null,null,null,null,null,null,null,null,null,null,null,null,null,null,null,null,null,null,91773,"City of San Dimas, Unincorporated San Dimas","X",null,null,null,"X"]
[null,null,null,null,null,null,null,null,null,null,null,null,null,null,null,null,null,null,91775,"City of San Gabriel, Unincorporated NE San Gabriel, City of Temple City","X",null,null,null,"X"]
[null,null,null,null,null,null,null,null,null,null,null,null,null,null,null,null,null,null,91776,"City of San Gabriel, Unincorporated NE San Gabriel","X",null,null,null,"X"]
[null,null,null,null,null,null,null,null,null,null,null,null,null,null,null,null,null,null,91780,"City of Temple City, Unincorporated Arcadia","X",null,null,null,"X"]
[null,null,null,null,null,null,null,null,null,null,null,null,null,null,null,null,null,null,91789,"City of Walnut, Rowland Heights, City of Diamond Bar, City of Industry, Unincorporated Walnut, City of Pomona","X"]
[null,null,null,null,null,null,null,null,null,null,null,null,null,null,null,null,null,null,91790,"City of West Covina","X"]
[null,null,null,null,null,null,null,null,null,null,null,null,null,null,null,null,null,null,91791,"City of West Covina, Valinda","X"]
[null,null,null,null,null,null,null,null,null,null,null,null,null,null,null,null,null,null,91792,"City of West Covina, San Jose Hills","X"]
[null,null,null,null,null,null,null,null,null,null,null,null,null,null,null,null,null,null,91801,"City of Alhambra","X",null,null,null,"X"]
[null,null,null,null,null,null,null,null,null,null,null,null,null,null,null,null,null,null,91803,"City of Alhambra","X"]
[null,null,null,null,null,null,null,null,null,null,null,null,null,null,null,null,null,null,92397,"Wrightwood",null,null,null,null,"X"]
[null,null,null,null,null,null,null,null,null,null,null,null,null,null,null,null,null,null,92821,"Rowland Heights","X"]
[null,null,null,null,null,null,null,null,null,null,null,null,null,null,null,null,null,null,92823,"Unincorporated Diamond Bar","X"]
[null,null,null,null,null,null,null,null,null,null,null,null,null,null,null,null,null,null,93243,"Unincorporated West Antelope Valley, Gorman",null,null,null,null,"X"]
[null,null,null,null,null,null,null,null,null,null,null,null,null,null,null,null,null,null,93510,"Acton",null,null,null,null,"X"]
[null,null,null,null,null,null,null,null,null,null,null,null,null,null,null,null,null,null,93523,"South Edwards/Edwards AFB",null,null,null,null,"X"]
[null,null,null,null,null,null,null,null,null,null,null,null,null,null,null,null,null,null,93532,"Lake Hughes, Elizabeth Lake",null,null,null,null,"X"]
[null,null,null,null,null,null,null,null,null,null,null,null,null,null,null,null,null,null,93534,"City of Lancaster, Unincorporated North Lancaster",null,null,null,null,"X"]
[null,null,null,null,null,null,null,null,null,null,null,null,null,null,null,null,null,null,93535,"City of Lancaster, Hi Vista, Roosevelt, Lake Los Angeles, Unincorporated North Lancaster",null,null,null,null,"X"]
[null,null,null,null,null,null,null,null,null,null,null,null,null,null,null,null,null,null,93536,"City of Lancaster, Quartz Hill, Del Sur, West Antelope Valley",null,null,null,null,"X"]
[null,null,null,null,null,null,null,null,null,null,null,null,null,null,null,null,null,null,93543,"Littlerock, Sun Village, Juniper Hills",null,null,null,null,"X"]
[null,null,null,null,null,null,null,null,null,null,null,null,null,null,null,null,null,null,93544,"Llano, Pearblossom",null,null,null,null,"X"]
[null,null,null,null,null,null,null,null,null,null,null,null,null,null,null,null,null,null,93550,"City of Palmdale, Unincorporated Palmdale, South Antelope Valley, Angeles National Forest",null,null,null,null,"X"]
[null,null,null,null,null,null,null,null,null,null,null,null,null,null,null,null,null,null,93551,"City of Palmdale, Leona Valley, Desert View Highlands, White Fence Farms, Anaverde",null,null,null,null,"X"]
[null,null,null,null,null,null,null,null,null,null,null,null,null,null,null,null,null,null,93552,"City of Palmdale, Unincorporated Palmdale, South Antelope Valley, Angeles National Forest",null,null,null,null,"X"]
[null,null,null,null,null,null,null,null,null,null,null,null,null,null,null,null,null,null,93553,"Pearblossom, Longview, Juniper Hills, Angeles National Forest",null,null,null,null,"X"]
[null,null,null,null,null,null,null,null,null,null,null,null,null,null,null,null,null,null,93563,"Valyermo, Llano, Angeles National Forest",null,null,null,null,"X"]
[null,null,null,null,null,null,null,null,null,null,null,null,null,null,null,null,null,null,93591,"Lake Los Angeles, Unincorporated Palmdale, Sun Village, Hi Vista, City of Palmdale",null,null,null,null,"X"]

{"sheet":"Data to Append","index":4,"n_rows":51,"n_cols":64,"rows_kept":51,"cut":false,"hidden":true,"merged":[]}
["CONTRACTOR NAME","CONTRACT TYPE (PEP, CCP, Other)","Other Contract Type","CONTRACT NUMBER","PROVIDER ID","Evidence Based Program/s Used","Service Planning Area/s Served","Supervisiorial District/s Served","Cities and Unincorporated Areas* Served","If City of LA, list the communities served","Zip Codes Served","CONTRACTOR ADDRESS","Phone","Website","Address for Additional Location","Phone2","Website2","Executive Director Name","Executive Director Phone","Executive Director Email","Prevention Program Director Name","Prevention Program Director Phone","Prevention Program Director Email","Prevention Program Coordinator Name","Prevention Program Coordinator Phone","Prevention Program Coordinator Email","Alternate Contact 1 (or the person required on all communications) Name","Alternate Contact 1 (or the person required on all communications) Phone","Alternate Contact 1 (or the person required on all communications) Email","Alternate Contact 2 (or the person required on all communications) Name","Alternate Contact 2 (or the person required on all communications) Phone","Alternate Contact 2 (or the person required on all communications) Email","Facebook Name/Handle","Facebook URL","Instagram Name/Handle","Instagram URL","Podcast Name/Handle","Podcast URL","Snapchat Name/Handle","Snapchat URL","Twitter Name/Handle","Twitter URL","TikTok Name/Handle","TikTok URL","YouTube Name/Handle","YouTube URL","Other 1 Platform","Other 1 Name/Handle","Other 1 URL","Other 2 Platform","Other 2 Name/Handle","Other 2 URL","Other 3 Platform","Other 3 Name/Handle","Other 3 URL","Priority Substance","Project Name (EBP/Local Innovative)","Activities","Short-Term Outcomes","Long-Term Outcomes","Start Date","End Date","Process Measures","Outcome Measures"]
[{"$f":"IF(ISBLANK('FY25-26 Work Plan'!$E$2:$E$2),\"\",'FY25-26 Work Plan'!$E$2:$E$2)","v":"Asian American Drug Abuse Programs, Inc. (AADAP)"},{"$f":"IF(ISBLANK('FY25-26 Work Plan'!$L$2:$L$2),\"\",'FY25-26 Work Plan'!$L$2:$L$2)","v":"Prevention Education Program (PEP)"},{"$f":"IF(ISBLANK('FY25-26 Work Plan'!$L$3:$L$3),\"\",'FY25-26 Work Plan'!$L$3:$L$3)","v":""},{"$f":"IF(ISBLANK('FY25-26 Work Plan'!$E$3:$E$3),\"\",'FY25-26 Work Plan'!$E$3:$E$3)","v":"PH-005150 "},{"$f":"IF(ISBLANK('FY25-26 Work Plan'!$E$4:$E$4),\"\",TEXT('FY25-26 Work Plan'!$E$4:$E$4,\"000000\"))","v":"000001"},{"$f":"IF(ISBLANK('FY25-26 Work Plan'!$L$4:$L$4),\"\",'FY25-26 Work Plan'!$L$4:$L$4)","v":""},{"$f":"IF(ISBLANK('FY25-26 Work Plan'!$E$5:$E$5),\"\",'FY25-26 Work Plan'!$E$5:$E$5)","v":"2 - San Fernando Valley"},{"$f":"IF(ISBLANK('FY25-26 Work Plan'!$L$5:$L$5),\"\",'FY25-26 Work Plan'!$L$5:$L$5)","v":""},{"$f":"IF(ISBLANK('FY25-26 Work Plan'!$E$6:$E$6),\"\",'FY25-26 Work Plan'!$E$6:$E$6)","v":"Agoura Hills, Agua Dulce*"},{"$f":"IF(ISBLANK('FY25-26 Work Plan'!$F$7:$F$7),\"\",'FY25-26 Work Plan'!$F$7:$F$7)","v":""},{"$f":"IF(ISBLANK('FY25-26 Work Plan'!$F$8:$F$8),\"\",'FY25-26 Work Plan'!$F$8:$F$8)","v":""},{"$f":"IF(ISBLANK('FY25-26 Work Plan'!$E$9:$E$9),\"\",'FY25-26 Work Plan'!$E$9:$E$9)","v":"123 E Main St., Suite 100 \nAnytown, CA 90000"},{"$f":"IF(ISBLANK('FY25-26 Work Plan'!$L$9:$L$9),\"\",TEXT('FY25-26 Work Plan'!$L$9:$L$9,\"###-###-####\"))","v":"999-999-9999"},{"$f":"IF(ISBLANK('FY25-26 Work Plan'!$L$10:$L$10),\"\",'FY25-26 Work Plan'!$L$10:$L$10)","v":"www.abc1.org"},{"$f":"IF(ISBLANK('FY25-26 Work Plan'!$E$11:$E$11),\"\",'FY25-26 Work Plan'!$E$11:$E$11)","v":"123 E Main St., Suite 100 \nAnytown, CA 90000"},{"$f":"IF(ISBLANK('FY25-26 Work Plan'!$L$11:$L$11),\"\",TEXT('FY25-26 Work Plan'!$L$11:$L$11,\"###-###-####\"))","v":"999-999-9999"},{"$f":"IF(ISBLANK('FY25-26 Work Plan'!$L$12:$L$12),\"\",'FY25-26 Work Plan'!$L$12:$L$12)","v":"www.abc2.org"},{"$f":"IF(ISBLANK('FY25-26 Work Plan'!$E$15:$E$15),\"\",'FY25-26 Work Plan'!$E$15:$E$15)","v":"John/Jane Doe"},{"$f":"IF(ISBLANK('FY25-26 Work Plan'!$I$15:$I$15),\"\",TEXT('FY25-26 Work Plan'!$I$15:$I$15,\"###-###-####\"))","v":"213-555-1212"},{"$f":"IF(ISBLANK('FY25-26 Work Plan'!$L$15:$L$15),\"\",'FY25-26 Work Plan'!$L$15:$L$15)","v":"janedoe@preventionusa.com"},{"$f":"IF(ISBLANK('FY25-26 Work Plan'!$E$16:$E$16),\"\",'FY25-26 Work Plan'!$E$16:$E$16)","v":"John/Jane Doe"},{"$f":"IF(ISBLANK('FY25-26 Work Plan'!$I$16:$I$16),\"\",TEXT('FY25-26 Work Plan'!$I$16:$I$16,\"###-###-####\"))","v":"213-555-1212"},{"$f":"IF(ISBLANK('FY25-26 Work Plan'!$L$16:$L$16),\"\",'FY25-26 Work Plan'!$L$16:$L$16)","v":"janedoe@preventionusa.com"},{"$f":"IF(ISBLANK('FY25-26 Work Plan'!$E$17:$E$17),\"\",'FY25-26 Work Plan'!$E$17:$E$17)","v":"John/Jane Doe"},{"$f":"IF(ISBLANK('FY25-26 Work Plan'!$I$17:$I$17),\"\",TEXT('FY25-26 Work Plan'!$I$17:$I$17,\"###-###-####\"))","v":"213-555-1212"},{"$f":"IF(ISBLANK('FY25-26 Work Plan'!$L$17:$L$17),\"\",'FY25-26 Work Plan'!$L$17:$L$17)","v":"j.doe@preventionusa.com"},{"$f":"IF(ISBLANK('FY25-26 Work Plan'!$E$18:$E$18),\"\",'FY25-26 Work Plan'!$E$18:$E$18)","v":"John/Jane Doe"},{"$f":"IF(ISBLANK('FY25-26 Work Plan'!$I$18:$I$18),\"\",TEXT('FY25-26 Work Plan'!$I$18:$I$18,\"###-###-####\"))","v":"213-555-1213"},{"$f":"IF(ISBLANK('FY25-26 Work Plan'!$L$18:$L$18),\"\",'FY25-26 Work Plan'!$L$18:$L$18)","v":"j.doe@preventionusa.com"},{"$f":"IF(ISBLANK('FY25-26 Work Plan'!$E$19:$E$19),\"\",'FY25-26 Work Plan'!$E$19:$E$19)","v":"John/Jane Doe"},{"$f":"IF(ISBLANK('FY25-26 Work Plan'!$I$19:$I$19),\"\",TEXT('FY25-26 Work Plan'!$I$19:$I$19,\"###-###-####\"))","v":"213-555-1213"},{"$f":"IF(ISBLANK('FY25-26 Work Plan'!$L$19:$L$19),\"\",'FY25-26 Work Plan'!$L$19:$L$19)","v":"j.doe@preventionusa.com"},{"$f":"IF(ISBLANK('FY25-26 Work Plan'!$E$23:$E$23),\"\",'FY25-26 Work Plan'!$E$23:$E$23)","v":""},{"$f":"IF(ISBLANK('FY25-26 Work Plan'!$I$23:$I$23),\"\",'FY25-26 Work Plan'!$I$23:$I$23)","v":""},{"$f":"IF(ISBLANK('FY25-26 Work Plan'!$E$24:$E$24),\"\",'FY25-26 Work Plan'!$E$24:$E$24)","v":""},{"$f":"IF(ISBLANK('FY25-26 Work Plan'!$I$24:$I$24),\"\",'FY25-26 Work Plan'!$I$24:$I$24)","v":""},{"$f":"IF(ISBLANK('FY25-26 Work Plan'!$E$25:$E$25),\"\",'FY25-26 Work Plan'!$E$25:$E$25)","v":""},{"$f":"IF(ISBLANK('FY25-26 Work Plan'!$I$25:$I$25),\"\",'FY25-26 Work Plan'!$I$25:$I$25)","v":""},{"$f":"IF(ISBLANK('FY25-26 Work Plan'!$E$26:$E$26),\"\",'FY25-26 Work Plan'!$E$26:$E$26)","v":""},{"$f":"IF(ISBLANK('FY25-26 Work Plan'!$I$26:$I$26),\"\",'FY25-26 Work Plan'!$I$26:$I$26)","v":""},{"$f":"IF(ISBLANK('FY25-26 Work Plan'!$E$27:$E$27),\"\",'FY25-26 Work Plan'!$E$27:$E$27)","v":""},{"$f":"IF(ISBLANK('FY25-26 Work Plan'!$I$27:$I$27),\"\",'FY25-26 Work Plan'!$I$27:$I$27)","v":""},{"$f":"IF(ISBLANK('FY25-26 Work Plan'!$E$28:$E$28),\"\",'FY25-26 Work Plan'!$E$28:$E$28)","v":""},{"$f":"IF(ISBLANK('FY25-26 Work Plan'!$I$28:$I$28),\"\",'FY25-26 Work Plan'!$I$28:$I$28)","v":""},{"$f":"IF(ISBLANK('FY25-26 Work Plan'!$E$29:$E$29),\"\",'FY25-26 Work Plan'!$E$29:$E$29)","v":""},{"$f":"IF(ISBLANK('FY25-26 Work Plan'!$I$29:$I$29),\"\",'FY25-26 Work Plan'!$I$29:$I$29)","v":""},{"$f":"IF(ISBLANK('FY25-26 Work Plan'!$B$30:$B$30),\"\",'FY25-26 Work Plan'!$B$30:$B$30)","v":""},{"$f":"IF(ISBLANK('FY25-26 Work Plan'!$E$30:$E$30),\"\",'FY25-26 Work Plan'!$E$30:$E$30)","v":""},{"$f":"IF(ISBLANK('FY25-26 Work Plan'!$I$30:$I$30),\"\",'FY25-26 Work Plan'!$I$30:$I$30)","v":""},{"$f":"IF(ISBLANK('FY25-26 Work Plan'!$B$31:$B$31),\"\",'FY25-26 Work Plan'!$B$31:$B$31)","v":""},{"$f":"IF(ISBLANK('FY25-26 Work Plan'!$E$31:$E$31),\"\",'FY25-26 Work Plan'!$E$31:$E$31)","v":""},{"$f":"IF(ISBLANK('FY25-26 Work Plan'!$I$31:$I$31),\"\",'FY25-26 Work Plan'!$I$31:$I$31)","v":""},{"$f":"IF(ISBLANK('FY25-26 Work Plan'!$B$32:$B$32),\"\",'FY25-26 Work Plan'!$B$32:$B$32)","v":""},{"$f":"IF(ISBLANK('FY25-26 Work Plan'!$E$32:$E$32),\"\",'FY25-26 Work Plan'!$E$32:$E$32)","v":""},{"$f":"IF(ISBLANK('FY25-26 Work Plan'!$I$32:$I$32),\"\",'FY25-26 Work Plan'!$I$32:$I$32)","v":""},{"$f":"IF(ISBLANK('FY25-26 Work Plan'!#REF!),\"\",'FY25-26 Work Plan'!#REF!)","v":{"$error":"#REF!"}},{"$f":"IF(ISBLANK('FY25-26 Work Plan'!#REF!),\"\",'FY25-26 Work Plan'!#REF!)","v":{"$error":"#REF!"}},{"$f":"IF(ISBLANK('FY25-26 Work Plan'!#REF!),\"\",'FY25-26 Work Plan'!#REF!)","v":{"$error":"#REF!"}},{"$f":"IF(ISBLANK('FY25-26 Work Plan'!#REF!),\"\",'FY25-26 Work Plan'!#REF!)","v":{"$error":"#REF!"}},{"$f":"IF(ISBLANK('FY25-26 Work Plan'!#REF!),\"\",'FY25-26 Work Plan'!#REF!)","v":{"$error":"#REF!"}},{"$f":"IF(ISBLANK('FY25-26 Work Plan'!#REF!),\"\",'FY25-26 Work Plan'!#REF!)","v":{"$error":"#REF!"}},{"$f":"IF(ISBLANK('FY25-26 Work Plan'!#REF!),\"\",'FY25-26 Work Plan'!#REF!)","v":{"$error":"#REF!"}},{"$f":"IF(ISBLANK('FY25-26 Work Plan'!#REF!),\"\",'FY25-26 Work Plan'!#REF!)","v":{"$error":"#REF!"}},{"$f":"IF(ISBLANK('FY25-26 Work Plan'!#REF!),\"\",'FY25-26 Work Plan'!#REF!)","v":{"$error":"#REF!"}}]
[{"$f":"IF(ISBLANK('FY25-26 Work Plan'!$E$2:$E$2),\"\",'FY25-26 Work Plan'!$E$2:$E$2)","v":"Asian American Drug Abuse Programs, Inc. (AADAP)"},{"$f":"IF(ISBLANK('FY25-26 Work Plan'!$L$2:$L$2),\"\",'FY25-26 Work Plan'!$L$2:$L$2)","v":"Prevention Education Program (PEP)"},{"$f":"IF(ISBLANK('FY25-26 Work Plan'!$L$3:$L$3),\"\",'FY25-26 Work Plan'!$L$3:$L$3)","v":""},{"$f":"IF(ISBLANK('FY25-26 Work Plan'!$E$3:$E$3),\"\",'FY25-26 Work Plan'!$E$3:$E$3)","v":"PH-005150 "},{"$f":"IF(ISBLANK('FY25-26 Work Plan'!$E$4:$E$4),\"\",TEXT('FY25-26 Work Plan'!$E$4:$E$4,\"000000\"))","v":"000001"},{"$f":"IF(ISBLANK('FY25-26 Work Plan'!$L$4:$L$4),\"\",'FY25-26 Work Plan'!$L$4:$L$4)","v":""},{"$f":"IF(ISBLANK('FY25-26 Work Plan'!$E$5:$E$5),\"\",'FY25-26 Work Plan'!$E$5:$E$5)","v":"2 - San Fernando Valley"},{"$f":"IF(ISBLANK('FY25-26 Work Plan'!$L$5:$L$5),\"\",'FY25-26 Work Plan'!$L$5:$L$5)","v":""},{"$f":"IF(ISBLANK('FY25-26 Work Plan'!$E$6:$E$6),\"\",'FY25-26 Work Plan'!$E$6:$E$6)","v":"Agoura Hills, Agua Dulce*"},{"$f":"IF(ISBLANK('FY25-26 Work Plan'!$F$7:$F$7),\"\",'FY25-26 Work Plan'!$F$7:$F$7)","v":""},{"$f":"IF(ISBLANK('FY25-26 Work Plan'!$F$8:$F$8),\"\",'FY25-26 Work Plan'!$F$8:$F$8)","v":""},{"$f":"IF(ISBLANK('FY25-26 Work Plan'!$E$9:$E$9),\"\",'FY25-26 Work Plan'!$E$9:$E$9)","v":"123 E Main St., Suite 100 \nAnytown, CA 90000"},{"$f":"IF(ISBLANK('FY25-26 Work Plan'!$L$9:$L$9),\"\",TEXT('FY25-26 Work Plan'!$L$9:$L$9,\"###-###-####\"))","v":"999-999-9999"},{"$f":"IF(ISBLANK('FY25-26 Work Plan'!$L$10:$L$10),\"\",'FY25-26 Work Plan'!$L$10:$L$10)","v":"www.abc1.org"},{"$f":"IF(ISBLANK('FY25-26 Work Plan'!$E$11:$E$11),\"\",'FY25-26 Work Plan'!$E$11:$E$11)","v":"123 E Main St., Suite 100 \nAnytown, CA 90000"},{"$f":"IF(ISBLANK('FY25-26 Work Plan'!$L$11:$L$11),\"\",TEXT('FY25-26 Work Plan'!$L$11:$L$11,\"###-###-####\"))","v":"999-999-9999"},{"$f":"IF(ISBLANK('FY25-26 Work Plan'!$L$12:$L$12),\"\",'FY25-26 Work Plan'!$L$12:$L$12)","v":"www.abc2.org"},{"$f":"IF(ISBLANK('FY25-26 Work Plan'!$E$15:$E$15),\"\",'FY25-26 Work Plan'!$E$15:$E$15)","v":"John/Jane Doe"},{"$f":"IF(ISBLANK('FY25-26 Work Plan'!$I$15:$I$15),\"\",TEXT('FY25-26 Work Plan'!$I$15:$I$15,\"###-###-####\"))","v":"213-555-1212"},{"$f":"IF(ISBLANK('FY25-26 Work Plan'!$L$15:$L$15),\"\",'FY25-26 Work Plan'!$L$15:$L$15)","v":"janedoe@preventionusa.com"},{"$f":"IF(ISBLANK('FY25-26 Work Plan'!$E$16:$E$16),\"\",'FY25-26 Work Plan'!$E$16:$E$16)","v":"John/Jane Doe"},{"$f":"IF(ISBLANK('FY25-26 Work Plan'!$I$16:$I$16),\"\",TEXT('FY25-26 Work Plan'!$I$16:$I$16,\"###-###-####\"))","v":"213-555-1212"},{"$f":"IF(ISBLANK('FY25-26 Work Plan'!$L$16:$L$16),\"\",'FY25-26 Work Plan'!$L$16:$L$16)","v":"janedoe@preventionusa.com"},{"$f":"IF(ISBLANK('FY25-26 Work Plan'!$E$17:$E$17),\"\",'FY25-26 Work Plan'!$E$17:$E$17)","v":"John/Jane Doe"},{"$f":"IF(ISBLANK('FY25-26 Work Plan'!$I$17:$I$17),\"\",TEXT('FY25-26 Work Plan'!$I$17:$I$17,\"###-###-####\"))","v":"213-555-1212"},{"$f":"IF(ISBLANK('FY25-26 Work Plan'!$L$17:$L$17),\"\",'FY25-26 Work Plan'!$L$17:$L$17)","v":"j.doe@preventionusa.com"},{"$f":"IF(ISBLANK('FY25-26 Work Plan'!$E$18:$E$18),\"\",'FY25-26 Work Plan'!$E$18:$E$18)","v":"John/Jane Doe"},{"$f":"IF(ISBLANK('FY25-26 Work Plan'!$I$18:$I$18),\"\",TEXT('FY25-26 Work Plan'!$I$18:$I$18,\"###-###-####\"))","v":"213-555-1213"},{"$f":"IF(ISBLANK('FY25-26 Work Plan'!$L$18:$L$18),\"\",'FY25-26 Work Plan'!$L$18:$L$18)","v":"j.doe@preventionusa.com"},{"$f":"IF(ISBLANK('FY25-26 Work Plan'!$E$19:$E$19),\"\",'FY25-26 Work Plan'!$E$19:$E$19)","v":"John/Jane Doe"},{"$f":"IF(ISBLANK('FY25-26 Work Plan'!$I$19:$I$19),\"\",TEXT('FY25-26 Work Plan'!$I$19:$I$19,\"###-###-####\"))","v":"213-555-1213"},{"$f":"IF(ISBLANK('FY25-26 Work Plan'!$L$19:$L$19),\"\",'FY25-26 Work Plan'!$L$19:$L$19)","v":"j.doe@preventionusa.com"},{"$f":"IF(ISBLANK('FY25-26 Work Plan'!$E$23:$E$23),\"\",'FY25-26 Work Plan'!$E$23:$E$23)","v":""},{"$f":"IF(ISBLANK('FY25-26 Work Plan'!$I$23:$I$23),\"\",'FY25-26 Work Plan'!$I$23:$I$23)","v":""},{"$f":"IF(ISBLANK('FY25-26 Work Plan'!$E$24:$E$24),\"\",'FY25-26 Work Plan'!$E$24:$E$24)","v":""},{"$f":"IF(ISBLANK('FY25-26 Work Plan'!$I$24:$I$24),\"\",'FY25-26 Work Plan'!$I$24:$I$24)","v":""},{"$f":"IF(ISBLANK('FY25-26 Work Plan'!$E$25:$E$25),\"\",'FY25-26 Work Plan'!$E$25:$E$25)","v":""},{"$f":"IF(ISBLANK('FY25-26 Work Plan'!$I$25:$I$25),\"\",'FY25-26 Work Plan'!$I$25:$I$25)","v":""},{"$f":"IF(ISBLANK('FY25-26 Work Plan'!$E$26:$E$26),\"\",'FY25-26 Work Plan'!$E$26:$E$26)","v":""},{"$f":"IF(ISBLANK('FY25-26 Work Plan'!$I$26:$I$26),\"\",'FY25-26 Work Plan'!$I$26:$I$26)","v":""},{"$f":"IF(ISBLANK('FY25-26 Work Plan'!$E$27:$E$27),\"\",'FY25-26 Work Plan'!$E$27:$E$27)","v":""},{"$f":"IF(ISBLANK('FY25-26 Work Plan'!$I$27:$I$27),\"\",'FY25-26 Work Plan'!$I$27:$I$27)","v":""},{"$f":"IF(ISBLANK('FY25-26 Work Plan'!$E$28:$E$28),\"\",'FY25-26 Work Plan'!$E$28:$E$28)","v":""},{"$f":"IF(ISBLANK('FY25-26 Work Plan'!$I$28:$I$28),\"\",'FY25-26 Work Plan'!$I$28:$I$28)","v":""},{"$f":"IF(ISBLANK('FY25-26 Work Plan'!$E$29:$E$29),\"\",'FY25-26 Work Plan'!$E$29:$E$29)","v":""},{"$f":"IF(ISBLANK('FY25-26 Work Plan'!$I$29:$I$29),\"\",'FY25-26 Work Plan'!$I$29:$I$29)","v":""},{"$f":"IF(ISBLANK('FY25-26 Work Plan'!$B$30:$B$30),\"\",'FY25-26 Work Plan'!$B$30:$B$30)","v":""},{"$f":"IF(ISBLANK('FY25-26 Work Plan'!$E$30:$E$30),\"\",'FY25-26 Work Plan'!$E$30:$E$30)","v":""},{"$f":"IF(ISBLANK('FY25-26 Work Plan'!$I$30:$I$30),\"\",'FY25-26 Work Plan'!$I$30:$I$30)","v":""},{"$f":"IF(ISBLANK('FY25-26 Work Plan'!$B$31:$B$31),\"\",'FY25-26 Work Plan'!$B$31:$B$31)","v":""},{"$f":"IF(ISBLANK('FY25-26 Work Plan'!$E$31:$E$31),\"\",'FY25-26 Work Plan'!$E$31:$E$31)","v":""},{"$f":"IF(ISBLANK('FY25-26 Work Plan'!$I$31:$I$31),\"\",'FY25-26 Work Plan'!$I$31:$I$31)","v":""},{"$f":"IF(ISBLANK('FY25-26 Work Plan'!$B$32:$B$32),\"\",'FY25-26 Work Plan'!$B$32:$B$32)","v":""},{"$f":"IF(ISBLANK('FY25-26 Work Plan'!$E$32:$E$32),\"\",'FY25-26 Work Plan'!$E$32:$E$32)","v":""},{"$f":"IF(ISBLANK('FY25-26 Work Plan'!$I$32:$I$32),\"\",'FY25-26 Work Plan'!$I$32:$I$32)","v":""},{"$f":"IF(ISBLANK('FY25-26 Work Plan'!#REF!),\"\",'FY25-26 Work Plan'!#REF!)","v":{"$error":"#REF!"}},{"$f":"IF(ISBLANK('FY25-26 Work Plan'!#REF!),\"\",'FY25-26 Work Plan'!#REF!)","v":{"$error":"#REF!"}},{"$f":"IF(ISBLANK('FY25-26 Work Plan'!#REF!),\"\",'FY25-26 Work Plan'!#REF!)","v":{"$error":"#REF!"}},{"$f":"IF(ISBLANK('FY25-26 Work Plan'!#REF!),\"\",'FY25-26 Work Plan'!#REF!)","v":{"$error":"#REF!"}},{"$f":"IF(ISBLANK('FY25-26 Work Plan'!#REF!),\"\",'FY25-26 Work Plan'!#REF!)","v":{"$error":"#REF!"}},{"$f":"IF(ISBLANK('FY25-26 Work Plan'!#REF!),\"\",'FY25-26 Work Plan'!#REF!)","v":{"$error":"#REF!"}},{"$f":"IF(ISBLANK('FY25-26 Work Plan'!#REF!),\"\",'FY25-26 Work Plan'!#REF!)","v":{"$error":"#REF!"}},{"$f":"IF(ISBLANK('FY25-26 Work Plan'!#REF!),\"\",'FY25-26 Work Plan'!#REF!)","v":{"$error":"#REF!"}},{"$f":"IF(ISBLANK('FY25-26 Work Plan'!#REF!),\"\",'FY25-26 Work Plan'!#REF!)","v":{"$error":"#REF!"}}]
[{"$f":"IF(ISBLANK('FY25-26 Work Plan'!$E$2:$E$2),\"\",'FY25-26 Work Plan'!$E$2:$E$2)","v":"Asian American Drug Abuse Programs, Inc. (AADAP)"},{"$f":"IF(ISBLANK('FY25-26 Work Plan'!$L$2:$L$2),\"\",'FY25-26 Work Plan'!$L$2:$L$2)","v":"Prevention Education Program (PEP)"},{"$f":"IF(ISBLANK('FY25-26 Work Plan'!$L$3:$L$3),\"\",'FY25-26 Work Plan'!$L$3:$L$3)","v":""},{"$f":"IF(ISBLANK('FY25-26 Work Plan'!$E$3:$E$3),\"\",'FY25-26 Work Plan'!$E$3:$E$3)","v":"PH-005150 "},{"$f":"IF(ISBLANK('FY25-26 Work Plan'!$E$4:$E$4),\"\",TEXT('FY25-26 Work Plan'!$E$4:$E$4,\"000000\"))","v":"000001"},{"$f":"IF(ISBLANK('FY25-26 Work Plan'!$L$4:$L$4),\"\",'FY25-26 Work Plan'!$L$4:$L$4)","v":""},{"$f":"IF(ISBLANK('FY25-26 Work Plan'!$E$5:$E$5),\"\",'FY25-26 Work Plan'!$E$5:$E$5)","v":"2 - San Fernando Valley"},{"$f":"IF(ISBLANK('FY25-26 Work Plan'!$L$5:$L$5),\"\",'FY25-26 Work Plan'!$L$5:$L$5)","v":""},{"$f":"IF(ISBLANK('FY25-26 Work Plan'!$E$6:$E$6),\"\",'FY25-26 Work Plan'!$E$6:$E$6)","v":"Agoura Hills, Agua Dulce*"},{"$f":"IF(ISBLANK('FY25-26 Work Plan'!$F$7:$F$7),\"\",'FY25-26 Work Plan'!$F$7:$F$7)","v":""},{"$f":"IF(ISBLANK('FY25-26 Work Plan'!$F$8:$F$8),\"\",'FY25-26 Work Plan'!$F$8:$F$8)","v":""},{"$f":"IF(ISBLANK('FY25-26 Work Plan'!$E$9:$E$9),\"\",'FY25-26 Work Plan'!$E$9:$E$9)","v":"123 E Main St., Suite 100 \nAnytown, CA 90000"},{"$f":"IF(ISBLANK('FY25-26 Work Plan'!$L$9:$L$9),\"\",TEXT('FY25-26 Work Plan'!$L$9:$L$9,\"###-###-####\"))","v":"999-999-9999"},{"$f":"IF(ISBLANK('FY25-26 Work Plan'!$L$10:$L$10),\"\",'FY25-26 Work Plan'!$L$10:$L$10)","v":"www.abc1.org"},{"$f":"IF(ISBLANK('FY25-26 Work Plan'!$E$11:$E$11),\"\",'FY25-26 Work Plan'!$E$11:$E$11)","v":"123 E Main St., Suite 100 \nAnytown, CA 90000"},{"$f":"IF(ISBLANK('FY25-26 Work Plan'!$L$11:$L$11),\"\",TEXT('FY25-26 Work Plan'!$L$11:$L$11,\"###-###-####\"))","v":"999-999-9999"},{"$f":"IF(ISBLANK('FY25-26 Work Plan'!$L$12:$L$12),\"\",'FY25-26 Work Plan'!$L$12:$L$12)","v":"www.abc2.org"},{"$f":"IF(ISBLANK('FY25-26 Work Plan'!$E$15:$E$15),\"\",'FY25-26 Work Plan'!$E$15:$E$15)","v":"John/Jane Doe"},{"$f":"IF(ISBLANK('FY25-26 Work Plan'!$I$15:$I$15),\"\",TEXT('FY25-26 Work Plan'!$I$15:$I$15,\"###-###-####\"))","v":"213-555-1212"},{"$f":"IF(ISBLANK('FY25-26 Work Plan'!$L$15:$L$15),\"\",'FY25-26 Work Plan'!$L$15:$L$15)","v":"janedoe@preventionusa.com"},{"$f":"IF(ISBLANK('FY25-26 Work Plan'!$E$16:$E$16),\"\",'FY25-26 Work Plan'!$E$16:$E$16)","v":"John/Jane Doe"},{"$f":"IF(ISBLANK('FY25-26 Work Plan'!$I$16:$I$16),\"\",TEXT('FY25-26 Work Plan'!$I$16:$I$16,\"###-###-####\"))","v":"213-555-1212"},{"$f":"IF(ISBLANK('FY25-26 Work Plan'!$L$16:$L$16),\"\",'FY25-26 Work Plan'!$L$16:$L$16)","v":"janedoe@preventionusa.com"},{"$f":"IF(ISBLANK('FY25-26 Work Plan'!$E$17:$E$17),\"\",'FY25-26 Work Plan'!$E$17:$E$17)","v":"John/Jane Doe"},{"$f":"IF(ISBLANK('FY25-26 Work Plan'!$I$17:$I$17),\"\",TEXT('FY25-26 Work Plan'!$I$17:$I$17,\"###-###-####\"))","v":"213-555-1212"},{"$f":"IF(ISBLANK('FY25-26 Work Plan'!$L$17:$L$17),\"\",'FY25-26 Work Plan'!$L$17:$L$17)","v":"j.doe@preventionusa.com"},{"$f":"IF(ISBLANK('FY25-26 Work Plan'!$E$18:$E$18),\"\",'FY25-26 Work Plan'!$E$18:$E$18)","v":"John/Jane Doe"},{"$f":"IF(ISBLANK('FY25-26 Work Plan'!$I$18:$I$18),\"\",TEXT('FY25-26 Work Plan'!$I$18:$I$18,\"###-###-####\"))","v":"213-555-1213"},{"$f":"IF(ISBLANK('FY25-26 Work Plan'!$L$18:$L$18),\"\",'FY25-26 Work Plan'!$L$18:$L$18)","v":"j.doe@preventionusa.com"},{"$f":"IF(ISBLANK('FY25-26 Work Plan'!$E$19:$E$19),\"\",'FY25-26 Work Plan'!$E$19:$E$19)","v":"John/Jane Doe"},{"$f":"IF(ISBLANK('FY25-26 Work Plan'!$I$19:$I$19),\"\",TEXT('FY25-26 Work Plan'!$I$19:$I$19,\"###-###-####\"))","v":"213-555-1213"},{"$f":"IF(ISBLANK('FY25-26 Work Plan'!$L$19:$L$19),\"\",'FY25-26 Work Plan'!$L$19:$L$19)","v":"j.doe@preventionusa.com"},{"$f":"IF(ISBLANK('FY25-26 Work Plan'!$E$23:$E$23),\"\",'FY25-26 Work Plan'!$E$23:$E$23)","v":""},{"$f":"IF(ISBLANK('FY25-26 Work Plan'!$I$23:$I$23),\"\",'FY25-26 Work Plan'!$I$23:$I$23)","v":""},{"$f":"IF(ISBLANK('FY25-26 Work Plan'!$E$24:$E$24),\"\",'FY25-26 Work Plan'!$E$24:$E$24)","v":""},{"$f":"IF(ISBLANK('FY25-26 Work Plan'!$I$24:$I$24),\"\",'FY25-26 Work Plan'!$I$24:$I$24)","v":""},{"$f":"IF(ISBLANK('FY25-26 Work Plan'!$E$25:$E$25),\"\",'FY25-26 Work Plan'!$E$25:$E$25)","v":""},{"$f":"IF(ISBLANK('FY25-26 Work Plan'!$I$25:$I$25),\"\",'FY25-26 Work Plan'!$I$25:$I$25)","v":""},{"$f":"IF(ISBLANK('FY25-26 Work Plan'!$E$26:$E$26),\"\",'FY25-26 Work Plan'!$E$26:$E$26)","v":""},{"$f":"IF(ISBLANK('FY25-26 Work Plan'!$I$26:$I$26),\"\",'FY25-26 Work Plan'!$I$26:$I$26)","v":""},{"$f":"IF(ISBLANK('FY25-26 Work Plan'!$E$27:$E$27),\"\",'FY25-26 Work Plan'!$E$27:$E$27)","v":""},{"$f":"IF(ISBLANK('FY25-26 Work Plan'!$I$27:$I$27),\"\",'FY25-26 Work Plan'!$I$27:$I$27)","v":""},{"$f":"IF(ISBLANK('FY25-26 Work Plan'!$E$28:$E$28),\"\",'FY25-26 Work Plan'!$E$28:$E$28)","v":""},{"$f":"IF(ISBLANK('FY25-26 Work Plan'!$I$28:$I$28),\"\",'FY25-26 Work Plan'!$I$28:$I$28)","v":""},{"$f":"IF(ISBLANK('FY25-26 Work Plan'!$E$29:$E$29),\"\",'FY25-26 Work Plan'!$E$29:$E$29)","v":""},{"$f":"IF(ISBLANK('FY25-26 Work Plan'!$I$29:$I$29),\"\",'FY25-26 Work Plan'!$I$29:$I$29)","v":""},{"$f":"IF(ISBLANK('FY25-26 Work Plan'!$B$30:$B$30),\"\",'FY25-26 Work Plan'!$B$30:$B$30)","v":""},{"$f":"IF(ISBLANK('FY25-26 Work Plan'!$E$30:$E$30),\"\",'FY25-26 Work Plan'!$E$30:$E$30)","v":""},{"$f":"IF(ISBLANK('FY25-26 Work Plan'!$I$30:$I$30),\"\",'FY25-26 Work Plan'!$I$30:$I$30)","v":""},{"$f":"IF(ISBLANK('FY25-26 Work Plan'!$B$31:$B$31),\"\",'FY25-26 Work Plan'!$B$31:$B$31)","v":""},{"$f":"IF(ISBLANK('FY25-26 Work Plan'!$E$31:$E$31),\"\",'FY25-26 Work Plan'!$E$31:$E$31)","v":""},{"$f":"IF(ISBLANK('FY25-26 Work Plan'!$I$31:$I$31),\"\",'FY25-26 Work Plan'!$I$31:$I$31)","v":""},{"$f":"IF(ISBLANK('FY25-26 Work Plan'!$B$32:$B$32),\"\",'FY25-26 Work Plan'!$B$32:$B$32)","v":""},{"$f":"IF(ISBLANK('FY25-26 Work Plan'!$E$32:$E$32),\"\",'FY25-26 Work Plan'!$E$32:$E$32)","v":""},{"$f":"IF(ISBLANK('FY25-26 Work Plan'!$I$32:$I$32),\"\",'FY25-26 Work Plan'!$I$32:$I$32)","v":""},{"$f":"IF(ISBLANK('FY25-26 Work Plan'!A37),\"\",'FY25-26 Work Plan'!A37)","v":"Alcohol, Marijuana, Rx-Opioids/Fentanyl, Rx (incl. Fentanyl)"},{"$f":"IF(ISBLANK('FY25-26 Work Plan'!E37),\"\",'FY25-26 Work Plan'!E37)","v":"https://www.blueprintsprograms.org/"},{"$f":"IF(ISBLANK('FY25-26 Work Plan'!F37),\"\",'FY25-26 Work Plan'!F37)","v":"Process: \nBy September 2025, Agency A will enroll 100 students into the Program A SUD Prevention Program."},{"$f":"IF(ISBLANK('FY25-26 Work Plan'!G37),\"\",'FY25-26 Work Plan'!G37)","v":"• Garner buy-in from principal to not only adopt program but to provide infrasture (e.g. designated room, materials, flyers, table for outreach, etc.) to assist with enrollment.\n• Establish year-long presence by providing outreach, office hours, before and after school to ensure sustainability of program.    \n• Deliver school-wide presentation providing awarenes around SUD disorder and information about the Program A SUD Prevention Program."},{"$f":"IF(ISBLANK('FY25-26 Work Plan'!#REF!),\"\",'FY25-26 Work Plan'!#REF!)","v":{"$error":"#REF!"}},{"$f":"IF(ISBLANK('FY25-26 Work Plan'!I37),\"\",'FY25-26 Work Plan'!I37)","v":"Enrollment Log, Outreach flyers distributed"},{"$f":"IF(ISBLANK('FY25-26 Work Plan'!J37),\"\",'FY25-26 Work Plan'!J37)","v":""},{"$f":"IF(ISBLANK('FY25-26 Work Plan'!K37),\"\",'FY25-26 Work Plan'!K37)","v":45863},{"$f":"IF(ISBLANK('FY25-26 Work Plan'!L37),\"\",'FY25-26 Work Plan'!L37)","v":""}]
[{"$f":"IF(ISBLANK('FY25-26 Work Plan'!$E$2:$E$2),\"\",'FY25-26 Work Plan'!$E$2:$E$2)","v":"Asian American Drug Abuse Programs, Inc. (AADAP)"},{"$f":"IF(ISBLANK('FY25-26 Work Plan'!$L$2:$L$2),\"\",'FY25-26 Work Plan'!$L$2:$L$2)","v":"Prevention Education Program (PEP)"},{"$f":"IF(ISBLANK('FY25-26 Work Plan'!$L$3:$L$3),\"\",'FY25-26 Work Plan'!$L$3:$L$3)","v":""},{"$f":"IF(ISBLANK('FY25-26 Work Plan'!$E$3:$E$3),\"\",'FY25-26 Work Plan'!$E$3:$E$3)","v":"PH-005150 "},{"$f":"IF(ISBLANK('FY25-26 Work Plan'!$E$4:$E$4),\"\",TEXT('FY25-26 Work Plan'!$E$4:$E$4,\"000000\"))","v":"000001"},{"$f":"IF(ISBLANK('FY25-26 Work Plan'!$L$4:$L$4),\"\",'FY25-26 Work Plan'!$L$4:$L$4)","v":""},{"$f":"IF(ISBLANK('FY25-26 Work Plan'!$E$5:$E$5),\"\",'FY25-26 Work Plan'!$E$5:$E$5)","v":"2 - San Fernando Valley"},{"$f":"IF(ISBLANK('FY25-26 Work Plan'!$L$5:$L$5),\"\",'FY25-26 Work Plan'!$L$5:$L$5)","v":""},{"$f":"IF(ISBLANK('FY25-26 Work Plan'!$E$6:$E$6),\"\",'FY25-26 Work Plan'!$E$6:$E$6)","v":"Agoura Hills, Agua Dulce*"},{"$f":"IF(ISBLANK('FY25-26 Work Plan'!$F$7:$F$7),\"\",'FY25-26 Work Plan'!$F$7:$F$7)","v":""},{"$f":"IF(ISBLANK('FY25-26 Work Plan'!$F$8:$F$8),\"\",'FY25-26 Work Plan'!$F$8:$F$8)","v":""},{"$f":"IF(ISBLANK('FY25-26 Work Plan'!$E$9:$E$9),\"\",'FY25-26 Work Plan'!$E$9:$E$9)","v":"123 E Main St., Suite 100 \nAnytown, CA 90000"},{"$f":"IF(ISBLANK('FY25-26 Work Plan'!$L$9:$L$9),\"\",TEXT('FY25-26 Work Plan'!$L$9:$L$9,\"###-###-####\"))","v":"999-999-9999"},{"$f":"IF(ISBLANK('FY25-26 Work Plan'!$L$10:$L$10),\"\",'FY25-26 Work Plan'!$L$10:$L$10)","v":"www.abc1.org"},{"$f":"IF(ISBLANK('FY25-26 Work Plan'!$E$11:$E$11),\"\",'FY25-26 Work Plan'!$E$11:$E$11)","v":"123 E Main St., Suite 100 \nAnytown, CA 90000"},{"$f":"IF(ISBLANK('FY25-26 Work Plan'!$L$11:$L$11),\"\",TEXT('FY25-26 Work Plan'!$L$11:$L$11,\"###-###-####\"))","v":"999-999-9999"},{"$f":"IF(ISBLANK('FY25-26 Work Plan'!$L$12:$L$12),\"\",'FY25-26 Work Plan'!$L$12:$L$12)","v":"www.abc2.org"},{"$f":"IF(ISBLANK('FY25-26 Work Plan'!$E$15:$E$15),\"\",'FY25-26 Work Plan'!$E$15:$E$15)","v":"John/Jane Doe"},{"$f":"IF(ISBLANK('FY25-26 Work Plan'!$I$15:$I$15),\"\",TEXT('FY25-26 Work Plan'!$I$15:$I$15,\"###-###-####\"))","v":"213-555-1212"},{"$f":"IF(ISBLANK('FY25-26 Work Plan'!$L$15:$L$15),\"\",'FY25-26 Work Plan'!$L$15:$L$15)","v":"janedoe@preventionusa.com"},{"$f":"IF(ISBLANK('FY25-26 Work Plan'!$E$16:$E$16),\"\",'FY25-26 Work Plan'!$E$16:$E$16)","v":"John/Jane Doe"},{"$f":"IF(ISBLANK('FY25-26 Work Plan'!$I$16:$I$16),\"\",TEXT('FY25-26 Work Plan'!$I$16:$I$16,\"###-###-####\"))","v":"213-555-1212"},{"$f":"IF(ISBLANK('FY25-26 Work Plan'!$L$16:$L$16),\"\",'FY25-26 Work Plan'!$L$16:$L$16)","v":"janedoe@preventionusa.com"},{"$f":"IF(ISBLANK('FY25-26 Work Plan'!$E$17:$E$17),\"\",'FY25-26 Work Plan'!$E$17:$E$17)","v":"John/Jane Doe"},{"$f":"IF(ISBLANK('FY25-26 Work Plan'!$I$17:$I$17),\"\",TEXT('FY25-26 Work Plan'!$I$17:$I$17,\"###-###-####\"))","v":"213-555-1212"},{"$f":"IF(ISBLANK('FY25-26 Work Plan'!$L$17:$L$17),\"\",'FY25-26 Work Plan'!$L$17:$L$17)","v":"j.doe@preventionusa.com"},{"$f":"IF(ISBLANK('FY25-26 Work Plan'!$E$18:$E$18),\"\",'FY25-26 Work Plan'!$E$18:$E$18)","v":"John/Jane Doe"},{"$f":"IF(ISBLANK('FY25-26 Work Plan'!$I$18:$I$18),\"\",TEXT('FY25-26 Work Plan'!$I$18:$I$18,\"###-###-####\"))","v":"213-555-1213"},{"$f":"IF(ISBLANK('FY25-26 Work Plan'!$L$18:$L$18),\"\",'FY25-26 Work Plan'!$L$18:$L$18)","v":"j.doe@preventionusa.com"},{"$f":"IF(ISBLANK('FY25-26 Work Plan'!$E$19:$E$19),\"\",'FY25-26 Work Plan'!$E$19:$E$19)","v":"John/Jane Doe"},{"$f":"IF(ISBLANK('FY25-26 Work Plan'!$I$19:$I$19),\"\",TEXT('FY25-26 Work Plan'!$I$19:$I$19,\"###-###-####\"))","v":"213-555-1213"},{"$f":"IF(ISBLANK('FY25-26 Work Plan'!$L$19:$L$19),\"\",'FY25-26 Work Plan'!$L$19:$L$19)","v":"j.doe@preventionusa.com"},{"$f":"IF(ISBLANK('FY25-26 Work Plan'!$E$23:$E$23),\"\",'FY25-26 Work Plan'!$E$23:$E$23)","v":""},{"$f":"IF(ISBLANK('FY25-26 Work Plan'!$I$23:$I$23),\"\",'FY25-26 Work Plan'!$I$23:$I$23)","v":""},{"$f":"IF(ISBLANK('FY25-26 Work Plan'!$E$24:$E$24),\"\",'FY25-26 Work Plan'!$E$24:$E$24)","v":""},{"$f":"IF(ISBLANK('FY25-26 Work Plan'!$I$24:$I$24),\"\",'FY25-26 Work Plan'!$I$24:$I$24)","v":""},{"$f":"IF(ISBLANK('FY25-26 Work Plan'!$E$25:$E$25),\"\",'FY25-26 Work Plan'!$E$25:$E$25)","v":""},{"$f":"IF(ISBLANK('FY25-26 Work Plan'!$I$25:$I$25),\"\",'FY25-26 Work Plan'!$I$25:$I$25)","v":""},{"$f":"IF(ISBLANK('FY25-26 Work Plan'!$E$26:$E$26),\"\",'FY25-26 Work Plan'!$E$26:$E$26)","v":""},{"$f":"IF(ISBLANK('FY25-26 Work Plan'!$I$26:$I$26),\"\",'FY25-26 Work Plan'!$I$26:$I$26)","v":""},{"$f":"IF(ISBLANK('FY25-26 Work Plan'!$E$27:$E$27),\"\",'FY25-26 Work Plan'!$E$27:$E$27)","v":""},{"$f":"IF(ISBLANK('FY25-26 Work Plan'!$I$27:$I$27),\"\",'FY25-26 Work Plan'!$I$27:$I$27)","v":""},{"$f":"IF(ISBLANK('FY25-26 Work Plan'!$E$28:$E$28),\"\",'FY25-26 Work Plan'!$E$28:$E$28)","v":""},{"$f":"IF(ISBLANK('FY25-26 Work Plan'!$I$28:$I$28),\"\",'FY25-26 Work Plan'!$I$28:$I$28)","v":""},{"$f":"IF(ISBLANK('FY25-26 Work Plan'!$E$29:$E$29),\"\",'FY25-26 Work Plan'!$E$29:$E$29)","v":""},{"$f":"IF(ISBLANK('FY25-26 Work Plan'!$I$29:$I$29),\"\",'FY25-26 Work Plan'!$I$29:$I$29)","v":""},{"$f":"IF(ISBLANK('FY25-26 Work Plan'!$B$30:$B$30),\"\",'FY25-26 Work Plan'!$B$30:$B$30)","v":""},{"$f":"IF(ISBLANK('FY25-26 Work Plan'!$E$30:$E$30),\"\",'FY25-26 Work Plan'!$E$30:$E$30)","v":""},{"$f":"IF(ISBLANK('FY25-26 Work Plan'!$I$30:$I$30),\"\",'FY25-26 Work Plan'!$I$30:$I$30)","v":""},{"$f":"IF(ISBLANK('FY25-26 Work Plan'!$B$31:$B$31),\"\",'FY25-26 Work Plan'!$B$31:$B$31)","v":""},{"$f":"IF(ISBLANK('FY25-26 Work Plan'!$E$31:$E$31),\"\",'FY25-26 Work Plan'!$E$31:$E$31)","v":""},{"$f":"IF(ISBLANK('FY25-26 Work Plan'!$I$31:$I$31),\"\",'FY25-26 Work Plan'!$I$31:$I$31)","v":""},{"$f":"IF(ISBLANK('FY25-26 Work Plan'!$B$32:$B$32),\"\",'FY25-26 Work Plan'!$B$32:$B$32)","v":""},{"$f":"IF(ISBLANK('FY25-26 Work Plan'!$E$32:$E$32),\"\",'FY25-26 Work Plan'!$E$32:$E$32)","v":""},{"$f":"IF(ISBLANK('FY25-26 Work Plan'!$I$32:$I$32),\"\",'FY25-26 Work Plan'!$I$32:$I$32)","v":""},{"$f":"IF(ISBLANK('FY25-26 Work Plan'!#REF!),\"\",'FY25-26 Work Plan'!#REF!)","v":{"$error":"#REF!"}},{"$f":"IF(ISBLANK('FY25-26 Work Plan'!#REF!),\"\",'FY25-26 Work Plan'!#REF!)","v":{"$error":"#REF!"}},{"$f":"IF(ISBLANK('FY25-26 Work Plan'!#REF!),\"\",'FY25-26 Work Plan'!#REF!)","v":{"$error":"#REF!"}},{"$f":"IF(ISBLANK('FY25-26 Work Plan'!#REF!),\"\",'FY25-26 Work Plan'!#REF!)","v":{"$error":"#REF!"}},{"$f":"IF(ISBLANK('FY25-26 Work Plan'!#REF!),\"\",'FY25-26 Work Plan'!#REF!)","v":{"$error":"#REF!"}},{"$f":"IF(ISBLANK('FY25-26 Work Plan'!#REF!),\"\",'FY25-26 Work Plan'!#REF!)","v":{"$error":"#REF!"}},{"$f":"IF(ISBLANK('FY25-26 Work Plan'!#REF!),\"\",'FY25-26 Work Plan'!#REF!)","v":{"$error":"#REF!"}},{"$f":"IF(ISBLANK('FY25-26 Work Plan'!#REF!),\"\",'FY25-26 Work Plan'!#REF!)","v":{"$error":"#REF!"}},{"$f":"IF(ISBLANK('FY25-26 Work Plan'!#REF!),\"\",'FY25-26 Work Plan'!#REF!)","v":{"$error":"#REF!"}}]
[{"$f":"IF(ISBLANK('FY25-26 Work Plan'!$E$2:$E$2),\"\",'FY25-26 Work Plan'!$E$2:$E$2)","v":"Asian American Drug Abuse Programs, Inc. (AADAP)"},{"$f":"IF(ISBLANK('FY25-26 Work Plan'!$L$2:$L$2),\"\",'FY25-26 Work Plan'!$L$2:$L$2)","v":"Prevention Education Program (PEP)"},{"$f":"IF(ISBLANK('FY25-26 Work Plan'!$L$3:$L$3),\"\",'FY25-26 Work Plan'!$L$3:$L$3)","v":""},{"$f":"IF(ISBLANK('FY25-26 Work Plan'!$E$3:$E$3),\"\",'FY25-26 Work Plan'!$E$3:$E$3)","v":"PH-005150 "},{"$f":"IF(ISBLANK('FY25-26 Work Plan'!$E$4:$E$4),\"\",TEXT('FY25-26 Work Plan'!$E$4:$E$4,\"000000\"))","v":"000001"},{"$f":"IF(ISBLANK('FY25-26 Work Plan'!$L$4:$L$4),\"\",'FY25-26 Work Plan'!$L$4:$L$4)","v":""},{"$f":"IF(ISBLANK('FY25-26 Work Plan'!$E$5:$E$5),\"\",'FY25-26 Work Plan'!$E$5:$E$5)","v":"2 - San Fernando Valley"},{"$f":"IF(ISBLANK('FY25-26 Work Plan'!$L$5:$L$5),\"\",'FY25-26 Work Plan'!$L$5:$L$5)","v":""},{"$f":"IF(ISBLANK('FY25-26 Work Plan'!$E$6:$E$6),\"\",'FY25-26 Work Plan'!$E$6:$E$6)","v":"Agoura Hills, Agua Dulce*"},{"$f":"IF(ISBLANK('FY25-26 Work Plan'!$F$7:$F$7),\"\",'FY25-26 Work Plan'!$F$7:$F$7)","v":""},{"$f":"IF(ISBLANK('FY25-26 Work Plan'!$F$8:$F$8),\"\",'FY25-26 Work Plan'!$F$8:$F$8)","v":""},{"$f":"IF(ISBLANK('FY25-26 Work Plan'!$E$9:$E$9),\"\",'FY25-26 Work Plan'!$E$9:$E$9)","v":"123 E Main St., Suite 100 \nAnytown, CA 90000"},{"$f":"IF(ISBLANK('FY25-26 Work Plan'!$L$9:$L$9),\"\",TEXT('FY25-26 Work Plan'!$L$9:$L$9,\"###-###-####\"))","v":"999-999-9999"},{"$f":"IF(ISBLANK('FY25-26 Work Plan'!$L$10:$L$10),\"\",'FY25-26 Work Plan'!$L$10:$L$10)","v":"www.abc1.org"},{"$f":"IF(ISBLANK('FY25-26 Work Plan'!$E$11:$E$11),\"\",'FY25-26 Work Plan'!$E$11:$E$11)","v":"123 E Main St., Suite 100 \nAnytown, CA 90000"},{"$f":"IF(ISBLANK('FY25-26 Work Plan'!$L$11:$L$11),\"\",TEXT('FY25-26 Work Plan'!$L$11:$L$11,\"###-###-####\"))","v":"999-999-9999"},{"$f":"IF(ISBLANK('FY25-26 Work Plan'!$L$12:$L$12),\"\",'FY25-26 Work Plan'!$L$12:$L$12)","v":"www.abc2.org"},{"$f":"IF(ISBLANK('FY25-26 Work Plan'!$E$15:$E$15),\"\",'FY25-26 Work Plan'!$E$15:$E$15)","v":"John/Jane Doe"},{"$f":"IF(ISBLANK('FY25-26 Work Plan'!$I$15:$I$15),\"\",TEXT('FY25-26 Work Plan'!$I$15:$I$15,\"###-###-####\"))","v":"213-555-1212"},{"$f":"IF(ISBLANK('FY25-26 Work Plan'!$L$15:$L$15),\"\",'FY25-26 Work Plan'!$L$15:$L$15)","v":"janedoe@preventionusa.com"},{"$f":"IF(ISBLANK('FY25-26 Work Plan'!$E$16:$E$16),\"\",'FY25-26 Work Plan'!$E$16:$E$16)","v":"John/Jane Doe"},{"$f":"IF(ISBLANK('FY25-26 Work Plan'!$I$16:$I$16),\"\",TEXT('FY25-26 Work Plan'!$I$16:$I$16,\"###-###-####\"))","v":"213-555-1212"},{"$f":"IF(ISBLANK('FY25-26 Work Plan'!$L$16:$L$16),\"\",'FY25-26 Work Plan'!$L$16:$L$16)","v":"janedoe@preventionusa.com"},{"$f":"IF(ISBLANK('FY25-26 Work Plan'!$E$17:$E$17),\"\",'FY25-26 Work Plan'!$E$17:$E$17)","v":"John/Jane Doe"},{"$f":"IF(ISBLANK('FY25-26 Work Plan'!$I$17:$I$17),\"\",TEXT('FY25-26 Work Plan'!$I$17:$I$17,\"###-###-####\"))","v":"213-555-1212"},{"$f":"IF(ISBLANK('FY25-26 Work Plan'!$L$17:$L$17),\"\",'FY25-26 Work Plan'!$L$17:$L$17)","v":"j.doe@preventionusa.com"},{"$f":"IF(ISBLANK('FY25-26 Work Plan'!$E$18:$E$18),\"\",'FY25-26 Work Plan'!$E$18:$E$18)","v":"John/Jane Doe"},{"$f":"IF(ISBLANK('FY25-26 Work Plan'!$I$18:$I$18),\"\",TEXT('FY25-26 Work Plan'!$I$18:$I$18,\"###-###-####\"))","v":"213-555-1213"},{"$f":"IF(ISBLANK('FY25-26 Work Plan'!$L$18:$L$18),\"\",'FY25-26 Work Plan'!$L$18:$L$18)","v":"j.doe@preventionusa.com"},{"$f":"IF(ISBLANK('FY25-26 Work Plan'!$E$19:$E$19),\"\",'FY25-26 Work Plan'!$E$19:$E$19)","v":"John/Jane Doe"},{"$f":"IF(ISBLANK('FY25-26 Work Plan'!$I$19:$I$19),\"\",TEXT('FY25-26 Work Plan'!$I$19:$I$19,\"###-###-####\"))","v":"213-555-1213"},{"$f":"IF(ISBLANK('FY25-26 Work Plan'!$L$19:$L$19),\"\",'FY25-26 Work Plan'!$L$19:$L$19)","v":"j.doe@preventionusa.com"},{"$f":"IF(ISBLANK('FY25-26 Work Plan'!$E$23:$E$23),\"\",'FY25-26 Work Plan'!$E$23:$E$23)","v":""},{"$f":"IF(ISBLANK('FY25-26 Work Plan'!$I$23:$I$23),\"\",'FY25-26 Work Plan'!$I$23:$I$23)","v":""},{"$f":"IF(ISBLANK('FY25-26 Work Plan'!$E$24:$E$24),\"\",'FY25-26 Work Plan'!$E$24:$E$24)","v":""},{"$f":"IF(ISBLANK('FY25-26 Work Plan'!$I$24:$I$24),\"\",'FY25-26 Work Plan'!$I$24:$I$24)","v":""},{"$f":"IF(ISBLANK('FY25-26 Work Plan'!$E$25:$E$25),\"\",'FY25-26 Work Plan'!$E$25:$E$25)","v":""},{"$f":"IF(ISBLANK('FY25-26 Work Plan'!$I$25:$I$25),\"\",'FY25-26 Work Plan'!$I$25:$I$25)","v":""},{"$f":"IF(ISBLANK('FY25-26 Work Plan'!$E$26:$E$26),\"\",'FY25-26 Work Plan'!$E$26:$E$26)","v":""},{"$f":"IF(ISBLANK('FY25-26 Work Plan'!$I$26:$I$26),\"\",'FY25-26 Work Plan'!$I$26:$I$26)","v":""},{"$f":"IF(ISBLANK('FY25-26 Work Plan'!$E$27:$E$27),\"\",'FY25-26 Work Plan'!$E$27:$E$27)","v":""},{"$f":"IF(ISBLANK('FY25-26 Work Plan'!$I$27:$I$27),\"\",'FY25-26 Work Plan'!$I$27:$I$27)","v":""},{"$f":"IF(ISBLANK('FY25-26 Work Plan'!$E$28:$E$28),\"\",'FY25-26 Work Plan'!$E$28:$E$28)","v":""},{"$f":"IF(ISBLANK('FY25-26 Work Plan'!$I$28:$I$28),\"\",'FY25-26 Work Plan'!$I$28:$I$28)","v":""},{"$f":"IF(ISBLANK('FY25-26 Work Plan'!$E$29:$E$29),\"\",'FY25-26 Work Plan'!$E$29:$E$29)","v":""},{"$f":"IF(ISBLANK('FY25-26 Work Plan'!$I$29:$I$29),\"\",'FY25-26 Work Plan'!$I$29:$I$29)","v":""},{"$f":"IF(ISBLANK('FY25-26 Work Plan'!$B$30:$B$30),\"\",'FY25-26 Work Plan'!$B$30:$B$30)","v":""},{"$f":"IF(ISBLANK('FY25-26 Work Plan'!$E$30:$E$30),\"\",'FY25-26 Work Plan'!$E$30:$E$30)","v":""},{"$f":"IF(ISBLANK('FY25-26 Work Plan'!$I$30:$I$30),\"\",'FY25-26 Work Plan'!$I$30:$I$30)","v":""},{"$f":"IF(ISBLANK('FY25-26 Work Plan'!$B$31:$B$31),\"\",'FY25-26 Work Plan'!$B$31:$B$31)","v":""},{"$f":"IF(ISBLANK('FY25-26 Work Plan'!$E$31:$E$31),\"\",'FY25-26 Work Plan'!$E$31:$E$31)","v":""},{"$f":"IF(ISBLANK('FY25-26 Work Plan'!$I$31:$I$31),\"\",'FY25-26 Work Plan'!$I$31:$I$31)","v":""},{"$f":"IF(ISBLANK('FY25-26 Work Plan'!$B$32:$B$32),\"\",'FY25-26 Work Plan'!$B$32:$B$32)","v":""},{"$f":"IF(ISBLANK('FY25-26 Work Plan'!$E$32:$E$32),\"\",'FY25-26 Work Plan'!$E$32:$E$32)","v":""},{"$f":"IF(ISBLANK('FY25-26 Work Plan'!$I$32:$I$32),\"\",'FY25-26 Work Plan'!$I$32:$I$32)","v":""},{"$f":"IF(ISBLANK('FY25-26 Work Plan'!#REF!),\"\",'FY25-26 Work Plan'!#REF!)","v":{"$error":"#REF!"}},{"$f":"IF(ISBLANK('FY25-26 Work Plan'!#REF!),\"\",'FY25-26 Work Plan'!#REF!)","v":{"$error":"#REF!"}},{"$f":"IF(ISBLANK('FY25-26 Work Plan'!#REF!),\"\",'FY25-26 Work Plan'!#REF!)","v":{"$error":"#REF!"}},{"$f":"IF(ISBLANK('FY25-26 Work Plan'!#REF!),\"\",'FY25-26 Work Plan'!#REF!)","v":{"$error":"#REF!"}},{"$f":"IF(ISBLANK('FY25-26 Work Plan'!#REF!),\"\",'FY25-26 Work Plan'!#REF!)","v":{"$error":"#REF!"}},{"$f":"IF(ISBLANK('FY25-26 Work Plan'!#REF!),\"\",'FY25-26 Work Plan'!#REF!)","v":{"$error":"#REF!"}},{"$f":"IF(ISBLANK('FY25-26 Work Plan'!#REF!),\"\",'FY25-26 Work Plan'!#REF!)","v":{"$error":"#REF!"}},{"$f":"IF(ISBLANK('FY25-26 Work Plan'!#REF!),\"\",'FY25-26 Work Plan'!#REF!)","v":{"$error":"#REF!"}},{"$f":"IF(ISBLANK('FY25-26 Work Plan'!#REF!),\"\",'FY25-26 Work Plan'!#REF!)","v":{"$error":"#REF!"}}]
[{"$f":"IF(ISBLANK('FY25-26 Work Plan'!$E$2:$E$2),\"\",'FY25-26 Work Plan'!$E$2:$E$2)","v":"Asian American Drug Abuse Programs, Inc. (AADAP)"},{"$f":"IF(ISBLANK('FY25-26 Work Plan'!$L$2:$L$2),\"\",'FY25-26 Work Plan'!$L$2:$L$2)","v":"Prevention Education Program (PEP)"},{"$f":"IF(ISBLANK('FY25-26 Work Plan'!$L$3:$L$3),\"\",'FY25-26 Work Plan'!$L$3:$L$3)","v":""},{"$f":"IF(ISBLANK('FY25-26 Work Plan'!$E$3:$E$3),\"\",'FY25-26 Work Plan'!$E$3:$E$3)","v":"PH-005150 "},{"$f":"IF(ISBLANK('FY25-26 Work Plan'!$E$4:$E$4),\"\",TEXT('FY25-26 Work Plan'!$E$4:$E$4,\"000000\"))","v":"000001"},{"$f":"IF(ISBLANK('FY25-26 Work Plan'!$L$4:$L$4),\"\",'FY25-26 Work Plan'!$L$4:$L$4)","v":""},{"$f":"IF(ISBLANK('FY25-26 Work Plan'!$E$5:$E$5),\"\",'FY25-26 Work Plan'!$E$5:$E$5)","v":"2 - San Fernando Valley"},{"$f":"IF(ISBLANK('FY25-26 Work Plan'!$L$5:$L$5),\"\",'FY25-26 Work Plan'!$L$5:$L$5)","v":""},{"$f":"IF(ISBLANK('FY25-26 Work Plan'!$E$6:$E$6),\"\",'FY25-26 Work Plan'!$E$6:$E$6)","v":"Agoura Hills, Agua Dulce*"},{"$f":"IF(ISBLANK('FY25-26 Work Plan'!$F$7:$F$7),\"\",'FY25-26 Work Plan'!$F$7:$F$7)","v":""},{"$f":"IF(ISBLANK('FY25-26 Work Plan'!$F$8:$F$8),\"\",'FY25-26 Work Plan'!$F$8:$F$8)","v":""},{"$f":"IF(ISBLANK('FY25-26 Work Plan'!$E$9:$E$9),\"\",'FY25-26 Work Plan'!$E$9:$E$9)","v":"123 E Main St., Suite 100 \nAnytown, CA 90000"},{"$f":"IF(ISBLANK('FY25-26 Work Plan'!$L$9:$L$9),\"\",TEXT('FY25-26 Work Plan'!$L$9:$L$9,\"###-###-####\"))","v":"999-999-9999"},{"$f":"IF(ISBLANK('FY25-26 Work Plan'!$L$10:$L$10),\"\",'FY25-26 Work Plan'!$L$10:$L$10)","v":"www.abc1.org"},{"$f":"IF(ISBLANK('FY25-26 Work Plan'!$E$11:$E$11),\"\",'FY25-26 Work Plan'!$E$11:$E$11)","v":"123 E Main St., Suite 100 \nAnytown, CA 90000"},{"$f":"IF(ISBLANK('FY25-26 Work Plan'!$L$11:$L$11),\"\",TEXT('FY25-26 Work Plan'!$L$11:$L$11,\"###-###-####\"))","v":"999-999-9999"},{"$f":"IF(ISBLANK('FY25-26 Work Plan'!$L$12:$L$12),\"\",'FY25-26 Work Plan'!$L$12:$L$12)","v":"www.abc2.org"},{"$f":"IF(ISBLANK('FY25-26 Work Plan'!$E$15:$E$15),\"\",'FY25-26 Work Plan'!$E$15:$E$15)","v":"John/Jane Doe"},{"$f":"IF(ISBLANK('FY25-26 Work Plan'!$I$15:$I$15),\"\",TEXT('FY25-26 Work Plan'!$I$15:$I$15,\"###-###-####\"))","v":"213-555-1212"},{"$f":"IF(ISBLANK('FY25-26 Work Plan'!$L$15:$L$15),\"\",'FY25-26 Work Plan'!$L$15:$L$15)","v":"janedoe@preventionusa.com"},{"$f":"IF(ISBLANK('FY25-26 Work Plan'!$E$16:$E$16),\"\",'FY25-26 Work Plan'!$E$16:$E$16)","v":"John/Jane Doe"},{"$f":"IF(ISBLANK('FY25-26 Work Plan'!$I$16:$I$16),\"\",TEXT('FY25-26 Work Plan'!$I$16:$I$16,\"###-###-####\"))","v":"213-555-1212"},{"$f":"IF(ISBLANK('FY25-26 Work Plan'!$L$16:$L$16),\"\",'FY25-26 Work Plan'!$L$16:$L$16)","v":"janedoe@preventionusa.com"},{"$f":"IF(ISBLANK('FY25-26 Work Plan'!$E$17:$E$17),\"\",'FY25-26 Work Plan'!$E$17:$E$17)","v":"John/Jane Doe"},{"$f":"IF(ISBLANK('FY25-26 Work Plan'!$I$17:$I$17),\"\",TEXT('FY25-26 Work Plan'!$I$17:$I$17,\"###-###-####\"))","v":"213-555-1212"},{"$f":"IF(ISBLANK('FY25-26 Work Plan'!$L$17:$L$17),\"\",'FY25-26 Work Plan'!$L$17:$L$17)","v":"j.doe@preventionusa.com"},{"$f":"IF(ISBLANK('FY25-26 Work Plan'!$E$18:$E$18),\"\",'FY25-26 Work Plan'!$E$18:$E$18)","v":"John/Jane Doe"},{"$f":"IF(ISBLANK('FY25-26 Work Plan'!$I$18:$I$18),\"\",TEXT('FY25-26 Work Plan'!$I$18:$I$18,\"###-###-####\"))","v":"213-555-1213"},{"$f":"IF(ISBLANK('FY25-26 Work Plan'!$L$18:$L$18),\"\",'FY25-26 Work Plan'!$L$18:$L$18)","v":"j.doe@preventionusa.com"},{"$f":"IF(ISBLANK('FY25-26 Work Plan'!$E$19:$E$19),\"\",'FY25-26 Work Plan'!$E$19:$E$19)","v":"John/Jane Doe"},{"$f":"IF(ISBLANK('FY25-26 Work Plan'!$I$19:$I$19),\"\",TEXT('FY25-26 Work Plan'!$I$19:$I$19,\"###-###-####\"))","v":"213-555-1213"},{"$f":"IF(ISBLANK('FY25-26 Work Plan'!$L$19:$L$19),\"\",'FY25-26 Work Plan'!$L$19:$L$19)","v":"j.doe@preventionusa.com"},{"$f":"IF(ISBLANK('FY25-26 Work Plan'!$E$23:$E$23),\"\",'FY25-26 Work Plan'!$E$23:$E$23)","v":""},{"$f":"IF(ISBLANK('FY25-26 Work Plan'!$I$23:$I$23),\"\",'FY25-26 Work Plan'!$I$23:$I$23)","v":""},{"$f":"IF(ISBLANK('FY25-26 Work Plan'!$E$24:$E$24),\"\",'FY25-26 Work Plan'!$E$24:$E$24)","v":""},{"$f":"IF(ISBLANK('FY25-26 Work Plan'!$I$24:$I$24),\"\",'FY25-26 Work Plan'!$I$24:$I$24)","v":""},{"$f":"IF(ISBLANK('FY25-26 Work Plan'!$E$25:$E$25),\"\",'FY25-26 Work Plan'!$E$25:$E$25)","v":""},{"$f":"IF(ISBLANK('FY25-26 Work Plan'!$I$25:$I$25),\"\",'FY25-26 Work Plan'!$I$25:$I$25)","v":""},{"$f":"IF(ISBLANK('FY25-26 Work Plan'!$E$26:$E$26),\"\",'FY25-26 Work Plan'!$E$26:$E$26)","v":""},{"$f":"IF(ISBLANK('FY25-26 Work Plan'!$I$26:$I$26),\"\",'FY25-26 Work Plan'!$I$26:$I$26)","v":""},{"$f":"IF(ISBLANK('FY25-26 Work Plan'!$E$27:$E$27),\"\",'FY25-26 Work Plan'!$E$27:$E$27)","v":""},{"$f":"IF(ISBLANK('FY25-26 Work Plan'!$I$27:$I$27),\"\",'FY25-26 Work Plan'!$I$27:$I$27)","v":""},{"$f":"IF(ISBLANK('FY25-26 Work Plan'!$E$28:$E$28),\"\",'FY25-26 Work Plan'!$E$28:$E$28)","v":""},{"$f":"IF(ISBLANK('FY25-26 Work Plan'!$I$28:$I$28),\"\",'FY25-26 Work Plan'!$I$28:$I$28)","v":""},{"$f":"IF(ISBLANK('FY25-26 Work Plan'!$E$29:$E$29),\"\",'FY25-26 Work Plan'!$E$29:$E$29)","v":""},{"$f":"IF(ISBLANK('FY25-26 Work Plan'!$I$29:$I$29),\"\",'FY25-26 Work Plan'!$I$29:$I$29)","v":""},{"$f":"IF(ISBLANK('FY25-26 Work Plan'!$B$30:$B$30),\"\",'FY25-26 Work Plan'!$B$30:$B$30)","v":""},{"$f":"IF(ISBLANK('FY25-26 Work Plan'!$E$30:$E$30),\"\",'FY25-26 Work Plan'!$E$30:$E$30)","v":""},{"$f":"IF(ISBLANK('FY25-26 Work Plan'!$I$30:$I$30),\"\",'FY25-26 Work Plan'!$I$30:$I$30)","v":""},{"$f":"IF(ISBLANK('FY25-26 Work Plan'!$B$31:$B$31),\"\",'FY25-26 Work Plan'!$B$31:$B$31)","v":""},{"$f":"IF(ISBLANK('FY25-26 Work Plan'!$E$31:$E$31),\"\",'FY25-26 Work Plan'!$E$31:$E$31)","v":""},{"$f":"IF(ISBLANK('FY25-26 Work Plan'!$I$31:$I$31),\"\",'FY25-26 Work Plan'!$I$31:$I$31)","v":""},{"$f":"IF(ISBLANK('FY25-26 Work Plan'!$B$32:$B$32),\"\",'FY25-26 Work Plan'!$B$32:$B$32)","v":""},{"$f":"IF(ISBLANK('FY25-26 Work Plan'!$E$32:$E$32),\"\",'FY25-26 Work Plan'!$E$32:$E$32)","v":""},{"$f":"IF(ISBLANK('FY25-26 Work Plan'!$I$32:$I$32),\"\",'FY25-26 Work Plan'!$I$32:$I$32)","v":""},{"$f":"IF(ISBLANK('FY25-26 Work Plan'!#REF!),\"\",'FY25-26 Work Plan'!#REF!)","v":{"$error":"#REF!"}},{"$f":"IF(ISBLANK('FY25-26 Work Plan'!#REF!),\"\",'FY25-26 Work Plan'!#REF!)","v":{"$error":"#REF!"}},{"$f":"IF(ISBLANK('FY25-26 Work Plan'!#REF!),\"\",'FY25-26 Work Plan'!#REF!)","v":{"$error":"#REF!"}},{"$f":"IF(ISBLANK('FY25-26 Work Plan'!#REF!),\"\",'FY25-26 Work Plan'!#REF!)","v":{"$error":"#REF!"}},{"$f":"IF(ISBLANK('FY25-26 Work Plan'!#REF!),\"\",'FY25-26 Work Plan'!#REF!)","v":{"$error":"#REF!"}},{"$f":"IF(ISBLANK('FY25-26 Work Plan'!#REF!),\"\",'FY25-26 Work Plan'!#REF!)","v":{"$error":"#REF!"}},{"$f":"IF(ISBLANK('FY25-26 Work Plan'!#REF!),\"\",'FY25-26 Work Plan'!#REF!)","v":{"$error":"#REF!"}},{"$f":"IF(ISBLANK('FY25-26 Work Plan'!#REF!),\"\",'FY25-26 Work Plan'!#REF!)","v":{"$error":"#REF!"}},{"$f":"IF(ISBLANK('FY25-26 Work Plan'!#REF!),\"\",'FY25-26 Work Plan'!#REF!)","v":{"$error":"#REF!"}}]
[{"$f":"IF(ISBLANK('FY25-26 Work Plan'!$E$2:$E$2),\"\",'FY25-26 Work Plan'!$E$2:$E$2)","v":"Asian American Drug Abuse Programs, Inc. (AADAP)"},{"$f":"IF(ISBLANK('FY25-26 Work Plan'!$L$2:$L$2),\"\",'FY25-26 Work Plan'!$L$2:$L$2)","v":"Prevention Education Program (PEP)"},{"$f":"IF(ISBLANK('FY25-26 Work Plan'!$L$3:$L$3),\"\",'FY25-26 Work Plan'!$L$3:$L$3)","v":""},{"$f":"IF(ISBLANK('FY25-26 Work Plan'!$E$3:$E$3),\"\",'FY25-26 Work Plan'!$E$3:$E$3)","v":"PH-005150 "},{"$f":"IF(ISBLANK('FY25-26 Work Plan'!$E$4:$E$4),\"\",TEXT('FY25-26 Work Plan'!$E$4:$E$4,\"000000\"))","v":"000001"},{"$f":"IF(ISBLANK('FY25-26 Work Plan'!$L$4:$L$4),\"\",'FY25-26 Work Plan'!$L$4:$L$4)","v":""},{"$f":"IF(ISBLANK('FY25-26 Work Plan'!$E$5:$E$5),\"\",'FY25-26 Work Plan'!$E$5:$E$5)","v":"2 - San Fernando Valley"},{"$f":"IF(ISBLANK('FY25-26 Work Plan'!$L$5:$L$5),\"\",'FY25-26 Work Plan'!$L$5:$L$5)","v":""},{"$f":"IF(ISBLANK('FY25-26 Work Plan'!$E$6:$E$6),\"\",'FY25-26 Work Plan'!$E$6:$E$6)","v":"Agoura Hills, Agua Dulce*"},{"$f":"IF(ISBLANK('FY25-26 Work Plan'!$F$7:$F$7),\"\",'FY25-26 Work Plan'!$F$7:$F$7)","v":""},{"$f":"IF(ISBLANK('FY25-26 Work Plan'!$F$8:$F$8),\"\",'FY25-26 Work Plan'!$F$8:$F$8)","v":""},{"$f":"IF(ISBLANK('FY25-26 Work Plan'!$E$9:$E$9),\"\",'FY25-26 Work Plan'!$E$9:$E$9)","v":"123 E Main St., Suite 100 \nAnytown, CA 90000"},{"$f":"IF(ISBLANK('FY25-26 Work Plan'!$L$9:$L$9),\"\",TEXT('FY25-26 Work Plan'!$L$9:$L$9,\"###-###-####\"))","v":"999-999-9999"},{"$f":"IF(ISBLANK('FY25-26 Work Plan'!$L$10:$L$10),\"\",'FY25-26 Work Plan'!$L$10:$L$10)","v":"www.abc1.org"},{"$f":"IF(ISBLANK('FY25-26 Work Plan'!$E$11:$E$11),\"\",'FY25-26 Work Plan'!$E$11:$E$11)","v":"123 E Main St., Suite 100 \nAnytown, CA 90000"},{"$f":"IF(ISBLANK('FY25-26 Work Plan'!$L$11:$L$11),\"\",TEXT('FY25-26 Work Plan'!$L$11:$L$11,\"###-###-####\"))","v":"999-999-9999"},{"$f":"IF(ISBLANK('FY25-26 Work Plan'!$L$12:$L$12),\"\",'FY25-26 Work Plan'!$L$12:$L$12)","v":"www.abc2.org"},{"$f":"IF(ISBLANK('FY25-26 Work Plan'!$E$15:$E$15),\"\",'FY25-26 Work Plan'!$E$15:$E$15)","v":"John/Jane Doe"},{"$f":"IF(ISBLANK('FY25-26 Work Plan'!$I$15:$I$15),\"\",TEXT('FY25-26 Work Plan'!$I$15:$I$15,\"###-###-####\"))","v":"213-555-1212"},{"$f":"IF(ISBLANK('FY25-26 Work Plan'!$L$15:$L$15),\"\",'FY25-26 Work Plan'!$L$15:$L$15)","v":"janedoe@preventionusa.com"},{"$f":"IF(ISBLANK('FY25-26 Work Plan'!$E$16:$E$16),\"\",'FY25-26 Work Plan'!$E$16:$E$16)","v":"John/Jane Doe"},{"$f":"IF(ISBLANK('FY25-26 Work Plan'!$I$16:$I$16),\"\",TEXT('FY25-26 Work Plan'!$I$16:$I$16,\"###-###-####\"))","v":"213-555-1212"},{"$f":"IF(ISBLANK('FY25-26 Work Plan'!$L$16:$L$16),\"\",'FY25-26 Work Plan'!$L$16:$L$16)","v":"janedoe@preventionusa.com"},{"$f":"IF(ISBLANK('FY25-26 Work Plan'!$E$17:$E$17),\"\",'FY25-26 Work Plan'!$E$17:$E$17)","v":"John/Jane Doe"},{"$f":"IF(ISBLANK('FY25-26 Work Plan'!$I$17:$I$17),\"\",TEXT('FY25-26 Work Plan'!$I$17:$I$17,\"###-###-####\"))","v":"213-555-1212"},{"$f":"IF(ISBLANK('FY25-26 Work Plan'!$L$17:$L$17),\"\",'FY25-26 Work Plan'!$L$17:$L$17)","v":"j.doe@preventionusa.com"},{"$f":"IF(ISBLANK('FY25-26 Work Plan'!$E$18:$E$18),\"\",'FY25-26 Work Plan'!$E$18:$E$18)","v":"John/Jane Doe"},{"$f":"IF(ISBLANK('FY25-26 Work Plan'!$I$18:$I$18),\"\",TEXT('FY25-26 Work Plan'!$I$18:$I$18,\"###-###-####\"))","v":"213-555-1213"},{"$f":"IF(ISBLANK('FY25-26 Work Plan'!$L$18:$L$18),\"\",'FY25-26 Work Plan'!$L$18:$L$18)","v":"j.doe@preventionusa.com"},{"$f":"IF(ISBLANK('FY25-26 Work Plan'!$E$19:$E$19),\"\",'FY25-26 Work Plan'!$E$19:$E$19)","v":"John/Jane Doe"},{"$f":"IF(ISBLANK('FY25-26 Work Plan'!$I$19:$I$19),\"\",TEXT('FY25-26 Work Plan'!$I$19:$I$19,\"###-###-####\"))","v":"213-555-1213"},{"$f":"IF(ISBLANK('FY25-26 Work Plan'!$L$19:$L$19),\"\",'FY25-26 Work Plan'!$L$19:$L$19)","v":"j.doe@preventionusa.com"},{"$f":"IF(ISBLANK('FY25-26 Work Plan'!$E$23:$E$23),\"\",'FY25-26 Work Plan'!$E$23:$E$23)","v":""},{"$f":"IF(ISBLANK('FY25-26 Work Plan'!$I$23:$I$23),\"\",'FY25-26 Work Plan'!$I$23:$I$23)","v":""},{"$f":"IF(ISBLANK('FY25-26 Work Plan'!$E$24:$E$24),\"\",'FY25-26 Work Plan'!$E$24:$E$24)","v":""},{"$f":"IF(ISBLANK('FY25-26 Work Plan'!$I$24:$I$24),\"\",'FY25-26 Work Plan'!$I$24:$I$24)","v":""},{"$f":"IF(ISBLANK('FY25-26 Work Plan'!$E$25:$E$25),\"\",'FY25-26 Work Plan'!$E$25:$E$25)","v":""},{"$f":"IF(ISBLANK('FY25-26 Work Plan'!$I$25:$I$25),\"\",'FY25-26 Work Plan'!$I$25:$I$25)","v":""},{"$f":"IF(ISBLANK('FY25-26 Work Plan'!$E$26:$E$26),\"\",'FY25-26 Work Plan'!$E$26:$E$26)","v":""},{"$f":"IF(ISBLANK('FY25-26 Work Plan'!$I$26:$I$26),\"\",'FY25-26 Work Plan'!$I$26:$I$26)","v":""},{"$f":"IF(ISBLANK('FY25-26 Work Plan'!$E$27:$E$27),\"\",'FY25-26 Work Plan'!$E$27:$E$27)","v":""},{"$f":"IF(ISBLANK('FY25-26 Work Plan'!$I$27:$I$27),\"\",'FY25-26 Work Plan'!$I$27:$I$27)","v":""},{"$f":"IF(ISBLANK('FY25-26 Work Plan'!$E$28:$E$28),\"\",'FY25-26 Work Plan'!$E$28:$E$28)","v":""},{"$f":"IF(ISBLANK('FY25-26 Work Plan'!$I$28:$I$28),\"\",'FY25-26 Work Plan'!$I$28:$I$28)","v":""},{"$f":"IF(ISBLANK('FY25-26 Work Plan'!$E$29:$E$29),\"\",'FY25-26 Work Plan'!$E$29:$E$29)","v":""},{"$f":"IF(ISBLANK('FY25-26 Work Plan'!$I$29:$I$29),\"\",'FY25-26 Work Plan'!$I$29:$I$29)","v":""},{"$f":"IF(ISBLANK('FY25-26 Work Plan'!$B$30:$B$30),\"\",'FY25-26 Work Plan'!$B$30:$B$30)","v":""},{"$f":"IF(ISBLANK('FY25-26 Work Plan'!$E$30:$E$30),\"\",'FY25-26 Work Plan'!$E$30:$E$30)","v":""},{"$f":"IF(ISBLANK('FY25-26 Work Plan'!$I$30:$I$30),\"\",'FY25-26 Work Plan'!$I$30:$I$30)","v":""},{"$f":"IF(ISBLANK('FY25-26 Work Plan'!$B$31:$B$31),\"\",'FY25-26 Work Plan'!$B$31:$B$31)","v":""},{"$f":"IF(ISBLANK('FY25-26 Work Plan'!$E$31:$E$31),\"\",'FY25-26 Work Plan'!$E$31:$E$31)","v":""},{"$f":"IF(ISBLANK('FY25-26 Work Plan'!$I$31:$I$31),\"\",'FY25-26 Work Plan'!$I$31:$I$31)","v":""},{"$f":"IF(ISBLANK('FY25-26 Work Plan'!$B$32:$B$32),\"\",'FY25-26 Work Plan'!$B$32:$B$32)","v":""},{"$f":"IF(ISBLANK('FY25-26 Work Plan'!$E$32:$E$32),\"\",'FY25-26 Work Plan'!$E$32:$E$32)","v":""},{"$f":"IF(ISBLANK('FY25-26 Work Plan'!$I$32:$I$32),\"\",'FY25-26 Work Plan'!$I$32:$I$32)","v":""},{"$f":"IF(ISBLANK('FY25-26 Work Plan'!#REF!),\"\",'FY25-26 Work Plan'!#REF!)","v":{"$error":"#REF!"}},{"$f":"IF(ISBLANK('FY25-26 Work Plan'!#REF!),\"\",'FY25-26 Work Plan'!#REF!)","v":{"$error":"#REF!"}},{"$f":"IF(ISBLANK('FY25-26 Work Plan'!#REF!),\"\",'FY25-26 Work Plan'!#REF!)","v":{"$error":"#REF!"}},{"$f":"IF(ISBLANK('FY25-26 Work Plan'!#REF!),\"\",'FY25-26 Work Plan'!#REF!)","v":{"$error":"#REF!"}},{"$f":"IF(ISBLANK('FY25-26 Work Plan'!#REF!),\"\",'FY25-26 Work Plan'!#REF!)","v":{"$error":"#REF!"}},{"$f":"IF(ISBLANK('FY25-26 Work Plan'!#REF!),\"\",'FY25-26 Work Plan'!#REF!)","v":{"$error":"#REF!"}},{"$f":"IF(ISBLANK('FY25-26 Work Plan'!#REF!),\"\",'FY25-26 Work Plan'!#REF!)","v":{"$error":"#REF!"}},{"$f":"IF(ISBLANK('FY25-26 Work Plan'!#REF!),\"\",'FY25-26 Work Plan'!#REF!)","v":{"$error":"#REF!"}},{"$f":"IF(ISBLANK('FY25-26 Work Plan'!#REF!),\"\",'FY25-26 Work Plan'!#REF!)","v":{"$error":"#REF!"}}]
[{"$f":"IF(ISBLANK('FY25-26 Work Plan'!$E$2:$E$2),\"\",'FY25-26 Work Plan'!$E$2:$E$2)","v":"Asian American Drug Abuse Programs, Inc. (AADAP)"},{"$f":"IF(ISBLANK('FY25-26 Work Plan'!$L$2:$L$2),\"\",'FY25-26 Work Plan'!$L$2:$L$2)","v":"Prevention Education Program (PEP)"},{"$f":"IF(ISBLANK('FY25-26 Work Plan'!$L$3:$L$3),\"\",'FY25-26 Work Plan'!$L$3:$L$3)","v":""},{"$f":"IF(ISBLANK('FY25-26 Work Plan'!$E$3:$E$3),\"\",'FY25-26 Work Plan'!$E$3:$E$3)","v":"PH-005150 "},{"$f":"IF(ISBLANK('FY25-26 Work Plan'!$E$4:$E$4),\"\",TEXT('FY25-26 Work Plan'!$E$4:$E$4,\"000000\"))","v":"000001"},{"$f":"IF(ISBLANK('FY25-26 Work Plan'!$L$4:$L$4),\"\",'FY25-26 Work Plan'!$L$4:$L$4)","v":""},{"$f":"IF(ISBLANK('FY25-26 Work Plan'!$E$5:$E$5),\"\",'FY25-26 Work Plan'!$E$5:$E$5)","v":"2 - San Fernando Valley"},{"$f":"IF(ISBLANK('FY25-26 Work Plan'!$L$5:$L$5),\"\",'FY25-26 Work Plan'!$L$5:$L$5)","v":""},{"$f":"IF(ISBLANK('FY25-26 Work Plan'!$E$6:$E$6),\"\",'FY25-26 Work Plan'!$E$6:$E$6)","v":"Agoura Hills, Agua Dulce*"},{"$f":"IF(ISBLANK('FY25-26 Work Plan'!$F$7:$F$7),\"\",'FY25-26 Work Plan'!$F$7:$F$7)","v":""},{"$f":"IF(ISBLANK('FY25-26 Work Plan'!$F$8:$F$8),\"\",'FY25-26 Work Plan'!$F$8:$F$8)","v":""},{"$f":"IF(ISBLANK('FY25-26 Work Plan'!$E$9:$E$9),\"\",'FY25-26 Work Plan'!$E$9:$E$9)","v":"123 E Main St., Suite 100 \nAnytown, CA 90000"},{"$f":"IF(ISBLANK('FY25-26 Work Plan'!$L$9:$L$9),\"\",TEXT('FY25-26 Work Plan'!$L$9:$L$9,\"###-###-####\"))","v":"999-999-9999"},{"$f":"IF(ISBLANK('FY25-26 Work Plan'!$L$10:$L$10),\"\",'FY25-26 Work Plan'!$L$10:$L$10)","v":"www.abc1.org"},{"$f":"IF(ISBLANK('FY25-26 Work Plan'!$E$11:$E$11),\"\",'FY25-26 Work Plan'!$E$11:$E$11)","v":"123 E Main St., Suite 100 \nAnytown, CA 90000"},{"$f":"IF(ISBLANK('FY25-26 Work Plan'!$L$11:$L$11),\"\",TEXT('FY25-26 Work Plan'!$L$11:$L$11,\"###-###-####\"))","v":"999-999-9999"},{"$f":"IF(ISBLANK('FY25-26 Work Plan'!$L$12:$L$12),\"\",'FY25-26 Work Plan'!$L$12:$L$12)","v":"www.abc2.org"},{"$f":"IF(ISBLANK('FY25-26 Work Plan'!$E$15:$E$15),\"\",'FY25-26 Work Plan'!$E$15:$E$15)","v":"John/Jane Doe"},{"$f":"IF(ISBLANK('FY25-26 Work Plan'!$I$15:$I$15),\"\",TEXT('FY25-26 Work Plan'!$I$15:$I$15,\"###-###-####\"))","v":"213-555-1212"},{"$f":"IF(ISBLANK('FY25-26 Work Plan'!$L$15:$L$15),\"\",'FY25-26 Work Plan'!$L$15:$L$15)","v":"janedoe@preventionusa.com"},{"$f":"IF(ISBLANK('FY25-26 Work Plan'!$E$16:$E$16),\"\",'FY25-26 Work Plan'!$E$16:$E$16)","v":"John/Jane Doe"},{"$f":"IF(ISBLANK('FY25-26 Work Plan'!$I$16:$I$16),\"\",TEXT('FY25-26 Work Plan'!$I$16:$I$16,\"###-###-####\"))","v":"213-555-1212"},{"$f":"IF(ISBLANK('FY25-26 Work Plan'!$L$16:$L$16),\"\",'FY25-26 Work Plan'!$L$16:$L$16)","v":"janedoe@preventionusa.com"},{"$f":"IF(ISBLANK('FY25-26 Work Plan'!$E$17:$E$17),\"\",'FY25-26 Work Plan'!$E$17:$E$17)","v":"John/Jane Doe"},{"$f":"IF(ISBLANK('FY25-26 Work Plan'!$I$17:$I$17),\"\",TEXT('FY25-26 Work Plan'!$I$17:$I$17,\"###-###-####\"))","v":"213-555-1212"},{"$f":"IF(ISBLANK('FY25-26 Work Plan'!$L$17:$L$17),\"\",'FY25-26 Work Plan'!$L$17:$L$17)","v":"j.doe@preventionusa.com"},{"$f":"IF(ISBLANK('FY25-26 Work Plan'!$E$18:$E$18),\"\",'FY25-26 Work Plan'!$E$18:$E$18)","v":"John/Jane Doe"},{"$f":"IF(ISBLANK('FY25-26 Work Plan'!$I$18:$I$18),\"\",TEXT('FY25-26 Work Plan'!$I$18:$I$18,\"###-###-####\"))","v":"213-555-1213"},{"$f":"IF(ISBLANK('FY25-26 Work Plan'!$L$18:$L$18),\"\",'FY25-26 Work Plan'!$L$18:$L$18)","v":"j.doe@preventionusa.com"},{"$f":"IF(ISBLANK('FY25-26 Work Plan'!$E$19:$E$19),\"\",'FY25-26 Work Plan'!$E$19:$E$19)","v":"John/Jane Doe"},{"$f":"IF(ISBLANK('FY25-26 Work Plan'!$I$19:$I$19),\"\",TEXT('FY25-26 Work Plan'!$I$19:$I$19,\"###-###-####\"))","v":"213-555-1213"},{"$f":"IF(ISBLANK('FY25-26 Work Plan'!$L$19:$L$19),\"\",'FY25-26 Work Plan'!$L$19:$L$19)","v":"j.doe@preventionusa.com"},{"$f":"IF(ISBLANK('FY25-26 Work Plan'!$E$23:$E$23),\"\",'FY25-26 Work Plan'!$E$23:$E$23)","v":""},{"$f":"IF(ISBLANK('FY25-26 Work Plan'!$I$23:$I$23),\"\",'FY25-26 Work Plan'!$I$23:$I$23)","v":""},{"$f":"IF(ISBLANK('FY25-26 Work Plan'!$E$24:$E$24),\"\",'FY25-26 Work Plan'!$E$24:$E$24)","v":""},{"$f":"IF(ISBLANK('FY25-26 Work Plan'!$I$24:$I$24),\"\",'FY25-26 Work Plan'!$I$24:$I$24)","v":""},{"$f":"IF(ISBLANK('FY25-26 Work Plan'!$E$25:$E$25),\"\",'FY25-26 Work Plan'!$E$25:$E$25)","v":""},{"$f":"IF(ISBLANK('FY25-26 Work Plan'!$I$25:$I$25),\"\",'FY25-26 Work Plan'!$I$25:$I$25)","v":""},{"$f":"IF(ISBLANK('FY25-26 Work Plan'!$E$26:$E$26),\"\",'FY25-26 Work Plan'!$E$26:$E$26)","v":""},{"$f":"IF(ISBLANK('FY25-26 Work Plan'!$I$26:$I$26),\"\",'FY25-26 Work Plan'!$I$26:$I$26)","v":""},{"$f":"IF(ISBLANK('FY25-26 Work Plan'!$E$27:$E$27),\"\",'FY25-26 Work Plan'!$E$27:$E$27)","v":""},{"$f":"IF(ISBLANK('FY25-26 Work Plan'!$I$27:$I$27),\"\",'FY25-26 Work Plan'!$I$27:$I$27)","v":""},{"$f":"IF(ISBLANK('FY25-26 Work Plan'!$E$28:$E$28),\"\",'FY25-26 Work Plan'!$E$28:$E$28)","v":""},{"$f":"IF(ISBLANK('FY25-26 Work Plan'!$I$28:$I$28),\"\",'FY25-26 Work Plan'!$I$28:$I$28)","v":""},{"$f":"IF(ISBLANK('FY25-26 Work Plan'!$E$29:$E$29),\"\",'FY25-26 Work Plan'!$E$29:$E$29)","v":""},{"$f":"IF(ISBLANK('FY25-26 Work Plan'!$I$29:$I$29),\"\",'FY25-26 Work Plan'!$I$29:$I$29)","v":""},{"$f":"IF(ISBLANK('FY25-26 Work Plan'!$B$30:$B$30),\"\",'FY25-26 Work Plan'!$B$30:$B$30)","v":""},{"$f":"IF(ISBLANK('FY25-26 Work Plan'!$E$30:$E$30),\"\",'FY25-26 Work Plan'!$E$30:$E$30)","v":""},{"$f":"IF(ISBLANK('FY25-26 Work Plan'!$I$30:$I$30),\"\",'FY25-26 Work Plan'!$I$30:$I$30)","v":""},{"$f":"IF(ISBLANK('FY25-26 Work Plan'!$B$31:$B$31),\"\",'FY25-26 Work Plan'!$B$31:$B$31)","v":""},{"$f":"IF(ISBLANK('FY25-26 Work Plan'!$E$31:$E$31),\"\",'FY25-26 Work Plan'!$E$31:$E$31)","v":""},{"$f":"IF(ISBLANK('FY25-26 Work Plan'!$I$31:$I$31),\"\",'FY25-26 Work Plan'!$I$31:$I$31)","v":""},{"$f":"IF(ISBLANK('FY25-26 Work Plan'!$B$32:$B$32),\"\",'FY25-26 Work Plan'!$B$32:$B$32)","v":""},{"$f":"IF(ISBLANK('FY25-26 Work Plan'!$E$32:$E$32),\"\",'FY25-26 Work Plan'!$E$32:$E$32)","v":""},{"$f":"IF(ISBLANK('FY25-26 Work Plan'!$I$32:$I$32),\"\",'FY25-26 Work Plan'!$I$32:$I$32)","v":""},{"$f":"IF(ISBLANK('FY25-26 Work Plan'!#REF!),\"\",'FY25-26 Work Plan'!#REF!)","v":{"$error":"#REF!"}},{"$f":"IF(ISBLANK('FY25-26 Work Plan'!#REF!),\"\",'FY25-26 Work Plan'!#REF!)","v":{"$error":"#REF!"}},{"$f":"IF(ISBLANK('FY25-26 Work Plan'!#REF!),\"\",'FY25-26 Work Plan'!#REF!)","v":{"$error":"#REF!"}},{"$f":"IF(ISBLANK('FY25-26 Work Plan'!#REF!),\"\",'FY25-26 Work Plan'!#REF!)","v":{"$error":"#REF!"}},{"$f":"IF(ISBLANK('FY25-26 Work Plan'!#REF!),\"\",'FY25-26 Work Plan'!#REF!)","v":{"$error":"#REF!"}},{"$f":"IF(ISBLANK('FY25-26 Work Plan'!#REF!),\"\",'FY25-26 Work Plan'!#REF!)","v":{"$error":"#REF!"}},{"$f":"IF(ISBLANK('FY25-26 Work Plan'!#REF!),\"\",'FY25-26 Work Plan'!#REF!)","v":{"$error":"#REF!"}},{"$f":"IF(ISBLANK('FY25-26 Work Plan'!#REF!),\"\",'FY25-26 Work Plan'!#REF!)","v":{"$error":"#REF!"}},{"$f":"IF(ISBLANK('FY25-26 Work Plan'!#REF!),\"\",'FY25-26 Work Plan'!#REF!)","v":{"$error":"#REF!"}}]
[{"$f":"IF(ISBLANK('FY25-26 Work Plan'!$E$2:$E$2),\"\",'FY25-26 Work Plan'!$E$2:$E$2)","v":"Asian American Drug Abuse Programs, Inc. (AADAP)"},{"$f":"IF(ISBLANK('FY25-26 Work Plan'!$L$2:$L$2),\"\",'FY25-26 Work Plan'!$L$2:$L$2)","v":"Prevention Education Program (PEP)"},{"$f":"IF(ISBLANK('FY25-26 Work Plan'!$L$3:$L$3),\"\",'FY25-26 Work Plan'!$L$3:$L$3)","v":""},{"$f":"IF(ISBLANK('FY25-26 Work Plan'!$E$3:$E$3),\"\",'FY25-26 Work Plan'!$E$3:$E$3)","v":"PH-005150 "},{"$f":"IF(ISBLANK('FY25-26 Work Plan'!$E$4:$E$4),\"\",TEXT('FY25-26 Work Plan'!$E$4:$E$4,\"000000\"))","v":"000001"},{"$f":"IF(ISBLANK('FY25-26 Work Plan'!$L$4:$L$4),\"\",'FY25-26 Work Plan'!$L$4:$L$4)","v":""},{"$f":"IF(ISBLANK('FY25-26 Work Plan'!$E$5:$E$5),\"\",'FY25-26 Work Plan'!$E$5:$E$5)","v":"2 - San Fernando Valley"},{"$f":"IF(ISBLANK('FY25-26 Work Plan'!$L$5:$L$5),\"\",'FY25-26 Work Plan'!$L$5:$L$5)","v":""},{"$f":"IF(ISBLANK('FY25-26 Work Plan'!$E$6:$E$6),\"\",'FY25-26 Work Plan'!$E$6:$E$6)","v":"Agoura Hills, Agua Dulce*"},{"$f":"IF(ISBLANK('FY25-26 Work Plan'!$F$7:$F$7),\"\",'FY25-26 Work Plan'!$F$7:$F$7)","v":""},{"$f":"IF(ISBLANK('FY25-26 Work Plan'!$F$8:$F$8),\"\",'FY25-26 Work Plan'!$F$8:$F$8)","v":""},{"$f":"IF(ISBLANK('FY25-26 Work Plan'!$E$9:$E$9),\"\",'FY25-26 Work Plan'!$E$9:$E$9)","v":"123 E Main St., Suite 100 \nAnytown, CA 90000"},{"$f":"IF(ISBLANK('FY25-26 Work Plan'!$L$9:$L$9),\"\",TEXT('FY25-26 Work Plan'!$L$9:$L$9,\"###-###-####\"))","v":"999-999-9999"},{"$f":"IF(ISBLANK('FY25-26 Work Plan'!$L$10:$L$10),\"\",'FY25-26 Work Plan'!$L$10:$L$10)","v":"www.abc1.org"},{"$f":"IF(ISBLANK('FY25-26 Work Plan'!$E$11:$E$11),\"\",'FY25-26 Work Plan'!$E$11:$E$11)","v":"123 E Main St., Suite 100 \nAnytown, CA 90000"},{"$f":"IF(ISBLANK('FY25-26 Work Plan'!$L$11:$L$11),\"\",TEXT('FY25-26 Work Plan'!$L$11:$L$11,\"###-###-####\"))","v":"999-999-9999"},{"$f":"IF(ISBLANK('FY25-26 Work Plan'!$L$12:$L$12),\"\",'FY25-26 Work Plan'!$L$12:$L$12)","v":"www.abc2.org"},{"$f":"IF(ISBLANK('FY25-26 Work Plan'!$E$15:$E$15),\"\",'FY25-26 Work Plan'!$E$15:$E$15)","v":"John/Jane Doe"},{"$f":"IF(ISBLANK('FY25-26 Work Plan'!$I$15:$I$15),\"\",TEXT('FY25-26 Work Plan'!$I$15:$I$15,\"###-###-####\"))","v":"213-555-1212"},{"$f":"IF(ISBLANK('FY25-26 Work Plan'!$L$15:$L$15),\"\",'FY25-26 Work Plan'!$L$15:$L$15)","v":"janedoe@preventionusa.com"},{"$f":"IF(ISBLANK('FY25-26 Work Plan'!$E$16:$E$16),\"\",'FY25-26 Work Plan'!$E$16:$E$16)","v":"John/Jane Doe"},{"$f":"IF(ISBLANK('FY25-26 Work Plan'!$I$16:$I$16),\"\",TEXT('FY25-26 Work Plan'!$I$16:$I$16,\"###-###-####\"))","v":"213-555-1212"},{"$f":"IF(ISBLANK('FY25-26 Work Plan'!$L$16:$L$16),\"\",'FY25-26 Work Plan'!$L$16:$L$16)","v":"janedoe@preventionusa.com"},{"$f":"IF(ISBLANK('FY25-26 Work Plan'!$E$17:$E$17),\"\",'FY25-26 Work Plan'!$E$17:$E$17)","v":"John/Jane Doe"},{"$f":"IF(ISBLANK('FY25-26 Work Plan'!$I$17:$I$17),\"\",TEXT('FY25-26 Work Plan'!$I$17:$I$17,\"###-###-####\"))","v":"213-555-1212"},{"$f":"IF(ISBLANK('FY25-26 Work Plan'!$L$17:$L$17),\"\",'FY25-26 Work Plan'!$L$17:$L$17)","v":"j.doe@preventionusa.com"},{"$f":"IF(ISBLANK('FY25-26 Work Plan'!$E$18:$E$18),\"\",'FY25-26 Work Plan'!$E$18:$E$18)","v":"John/Jane Doe"},{"$f":"IF(ISBLANK('FY25-26 Work Plan'!$I$18:$I$18),\"\",TEXT('FY25-26 Work Plan'!$I$18:$I$18,\"###-###-####\"))","v":"213-555-1213"},{"$f":"IF(ISBLANK('FY25-26 Work Plan'!$L$18:$L$18),\"\",'FY25-26 Work Plan'!$L$18:$L$18)","v":"j.doe@preventionusa.com"},{"$f":"IF(ISBLANK('FY25-26 Work Plan'!$E$19:$E$19),\"\",'FY25-26 Work Plan'!$E$19:$E$19)","v":"John/Jane Doe"},{"$f":"IF(ISBLANK('FY25-26 Work Plan'!$I$19:$I$19),\"\",TEXT('FY25-26 Work Plan'!$I$19:$I$19,\"###-###-####\"))","v":"213-555-1213"},{"$f":"IF(ISBLANK('FY25-26 Work Plan'!$L$19:$L$19),\"\",'FY25-26 Work Plan'!$L$19:$L$19)","v":"j.doe@preventionusa.com"},{"$f":"IF(ISBLANK('FY25-26 Work Plan'!$E$23:$E$23),\"\",'FY25-26 Work Plan'!$E$23:$E$23)","v":""},{"$f":"IF(ISBLANK('FY25-26 Work Plan'!$I$23:$I$23),\"\",'FY25-26 Work Plan'!$I$23:$I$23)","v":""},{"$f":"IF(ISBLANK('FY25-26 Work Plan'!$E$24:$E$24),\"\",'FY25-26 Work Plan'!$E$24:$E$24)","v":""},{"$f":"IF(ISBLANK('FY25-26 Work Plan'!$I$24:$I$24),\"\",'FY25-26 Work Plan'!$I$24:$I$24)","v":""},{"$f":"IF(ISBLANK('FY25-26 Work Plan'!$E$25:$E$25),\"\",'FY25-26 Work Plan'!$E$25:$E$25)","v":""},{"$f":"IF(ISBLANK('FY25-26 Work Plan'!$I$25:$I$25),\"\",'FY25-26 Work Plan'!$I$25:$I$25)","v":""},{"$f":"IF(ISBLANK('FY25-26 Work Plan'!$E$26:$E$26),\"\",'FY25-26 Work Plan'!$E$26:$E$26)","v":""},{"$f":"IF(ISBLANK('FY25-26 Work Plan'!$I$26:$I$26),\"\",'FY25-26 Work Plan'!$I$26:$I$26)","v":""},{"$f":"IF(ISBLANK('FY25-26 Work Plan'!$E$27:$E$27),\"\",'FY25-26 Work Plan'!$E$27:$E$27)","v":""},{"$f":"IF(ISBLANK('FY25-26 Work Plan'!$I$27:$I$27),\"\",'FY25-26 Work Plan'!$I$27:$I$27)","v":""},{"$f":"IF(ISBLANK('FY25-26 Work Plan'!$E$28:$E$28),\"\",'FY25-26 Work Plan'!$E$28:$E$28)","v":""},{"$f":"IF(ISBLANK('FY25-26 Work Plan'!$I$28:$I$28),\"\",'FY25-26 Work Plan'!$I$28:$I$28)","v":""},{"$f":"IF(ISBLANK('FY25-26 Work Plan'!$E$29:$E$29),\"\",'FY25-26 Work Plan'!$E$29:$E$29)","v":""},{"$f":"IF(ISBLANK('FY25-26 Work Plan'!$I$29:$I$29),\"\",'FY25-26 Work Plan'!$I$29:$I$29)","v":""},{"$f":"IF(ISBLANK('FY25-26 Work Plan'!$B$30:$B$30),\"\",'FY25-26 Work Plan'!$B$30:$B$30)","v":""},{"$f":"IF(ISBLANK('FY25-26 Work Plan'!$E$30:$E$30),\"\",'FY25-26 Work Plan'!$E$30:$E$30)","v":""},{"$f":"IF(ISBLANK('FY25-26 Work Plan'!$I$30:$I$30),\"\",'FY25-26 Work Plan'!$I$30:$I$30)","v":""},{"$f":"IF(ISBLANK('FY25-26 Work Plan'!$B$31:$B$31),\"\",'FY25-26 Work Plan'!$B$31:$B$31)","v":""},{"$f":"IF(ISBLANK('FY25-26 Work Plan'!$E$31:$E$31),\"\",'FY25-26 Work Plan'!$E$31:$E$31)","v":""},{"$f":"IF(ISBLANK('FY25-26 Work Plan'!$I$31:$I$31),\"\",'FY25-26 Work Plan'!$I$31:$I$31)","v":""},{"$f":"IF(ISBLANK('FY25-26 Work Plan'!$B$32:$B$32),\"\",'FY25-26 Work Plan'!$B$32:$B$32)","v":""},{"$f":"IF(ISBLANK('FY25-26 Work Plan'!$E$32:$E$32),\"\",'FY25-26 Work Plan'!$E$32:$E$32)","v":""},{"$f":"IF(ISBLANK('FY25-26 Work Plan'!$I$32:$I$32),\"\",'FY25-26 Work Plan'!$I$32:$I$32)","v":""},{"$f":"IF(ISBLANK('FY25-26 Work Plan'!#REF!),\"\",'FY25-26 Work Plan'!#REF!)","v":{"$error":"#REF!"}},{"$f":"IF(ISBLANK('FY25-26 Work Plan'!#REF!),\"\",'FY25-26 Work Plan'!#REF!)","v":{"$error":"#REF!"}},{"$f":"IF(ISBLANK('FY25-26 Work Plan'!#REF!),\"\",'FY25-26 Work Plan'!#REF!)","v":{"$error":"#REF!"}},{"$f":"IF(ISBLANK('FY25-26 Work Plan'!#REF!),\"\",'FY25-26 Work Plan'!#REF!)","v":{"$error":"#REF!"}},{"$f":"IF(ISBLANK('FY25-26 Work Plan'!#REF!),\"\",'FY25-26 Work Plan'!#REF!)","v":{"$error":"#REF!"}},{"$f":"IF(ISBLANK('FY25-26 Work Plan'!#REF!),\"\",'FY25-26 Work Plan'!#REF!)","v":{"$error":"#REF!"}},{"$f":"IF(ISBLANK('FY25-26 Work Plan'!#REF!),\"\",'FY25-26 Work Plan'!#REF!)","v":{"$error":"#REF!"}},{"$f":"IF(ISBLANK('FY25-26 Work Plan'!#REF!),\"\",'FY25-26 Work Plan'!#REF!)","v":{"$error":"#REF!"}},{"$f":"IF(ISBLANK('FY25-26 Work Plan'!#REF!),\"\",'FY25-26 Work Plan'!#REF!)","v":{"$error":"#REF!"}}]
[{"$f":"IF(ISBLANK('FY25-26 Work Plan'!$E$2:$E$2),\"\",'FY25-26 Work Plan'!$E$2:$E$2)","v":"Asian American Drug Abuse Programs, Inc. (AADAP)"},{"$f":"IF(ISBLANK('FY25-26 Work Plan'!$L$2:$L$2),\"\",'FY25-26 Work Plan'!$L$2:$L$2)","v":"Prevention Education Program (PEP)"},{"$f":"IF(ISBLANK('FY25-26 Work Plan'!$L$3:$L$3),\"\",'FY25-26 Work Plan'!$L$3:$L$3)","v":""},{"$f":"IF(ISBLANK('FY25-26 Work Plan'!$E$3:$E$3),\"\",'FY25-26 Work Plan'!$E$3:$E$3)","v":"PH-005150 "},{"$f":"IF(ISBLANK('FY25-26 Work Plan'!$E$4:$E$4),\"\",TEXT('FY25-26 Work Plan'!$E$4:$E$4,\"000000\"))","v":"000001"},{"$f":"IF(ISBLANK('FY25-26 Work Plan'!$L$4:$L$4),\"\",'FY25-26 Work Plan'!$L$4:$L$4)","v":""},{"$f":"IF(ISBLANK('FY25-26 Work Plan'!$E$5:$E$5),\"\",'FY25-26 Work Plan'!$E$5:$E$5)","v":"2 - San Fernando Valley"},{"$f":"IF(ISBLANK('FY25-26 Work Plan'!$L$5:$L$5),\"\",'FY25-26 Work Plan'!$L$5:$L$5)","v":""},{"$f":"IF(ISBLANK('FY25-26 Work Plan'!$E$6:$E$6),\"\",'FY25-26 Work Plan'!$E$6:$E$6)","v":"Agoura Hills, Agua Dulce*"},{"$f":"IF(ISBLANK('FY25-26 Work Plan'!$F$7:$F$7),\"\",'FY25-26 Work Plan'!$F$7:$F$7)","v":""},{"$f":"IF(ISBLANK('FY25-26 Work Plan'!$F$8:$F$8),\"\",'FY25-26 Work Plan'!$F$8:$F$8)","v":""},{"$f":"IF(ISBLANK('FY25-26 Work Plan'!$E$9:$E$9),\"\",'FY25-26 Work Plan'!$E$9:$E$9)","v":"123 E Main St., Suite 100 \nAnytown, CA 90000"},{"$f":"IF(ISBLANK('FY25-26 Work Plan'!$L$9:$L$9),\"\",TEXT('FY25-26 Work Plan'!$L$9:$L$9,\"###-###-####\"))","v":"999-999-9999"},{"$f":"IF(ISBLANK('FY25-26 Work Plan'!$L$10:$L$10),\"\",'FY25-26 Work Plan'!$L$10:$L$10)","v":"www.abc1.org"},{"$f":"IF(ISBLANK('FY25-26 Work Plan'!$E$11:$E$11),\"\",'FY25-26 Work Plan'!$E$11:$E$11)","v":"123 E Main St., Suite 100 \nAnytown, CA 90000"},{"$f":"IF(ISBLANK('FY25-26 Work Plan'!$L$11:$L$11),\"\",TEXT('FY25-26 Work Plan'!$L$11:$L$11,\"###-###-####\"))","v":"999-999-9999"},{"$f":"IF(ISBLANK('FY25-26 Work Plan'!$L$12:$L$12),\"\",'FY25-26 Work Plan'!$L$12:$L$12)","v":"www.abc2.org"},{"$f":"IF(ISBLANK('FY25-26 Work Plan'!$E$15:$E$15),\"\",'FY25-26 Work Plan'!$E$15:$E$15)","v":"John/Jane Doe"},{"$f":"IF(ISBLANK('FY25-26 Work Plan'!$I$15:$I$15),\"\",TEXT('FY25-26 Work Plan'!$I$15:$I$15,\"###-###-####\"))","v":"213-555-1212"},{"$f":"IF(ISBLANK('FY25-26 Work Plan'!$L$15:$L$15),\"\",'FY25-26 Work Plan'!$L$15:$L$15)","v":"janedoe@preventionusa.com"},{"$f":"IF(ISBLANK('FY25-26 Work Plan'!$E$16:$E$16),\"\",'FY25-26 Work Plan'!$E$16:$E$16)","v":"John/Jane Doe"},{"$f":"IF(ISBLANK('FY25-26 Work Plan'!$I$16:$I$16),\"\",TEXT('FY25-26 Work Plan'!$I$16:$I$16,\"###-###-####\"))","v":"213-555-1212"},{"$f":"IF(ISBLANK('FY25-26 Work Plan'!$L$16:$L$16),\"\",'FY25-26 Work Plan'!$L$16:$L$16)","v":"janedoe@preventionusa.com"},{"$f":"IF(ISBLANK('FY25-26 Work Plan'!$E$17:$E$17),\"\",'FY25-26 Work Plan'!$E$17:$E$17)","v":"John/Jane Doe"},{"$f":"IF(ISBLANK('FY25-26 Work Plan'!$I$17:$I$17),\"\",TEXT('FY25-26 Work Plan'!$I$17:$I$17,\"###-###-####\"))","v":"213-555-1212"},{"$f":"IF(ISBLANK('FY25-26 Work Plan'!$L$17:$L$17),\"\",'FY25-26 Work Plan'!$L$17:$L$17)","v":"j.doe@preventionusa.com"},{"$f":"IF(ISBLANK('FY25-26 Work Plan'!$E$18:$E$18),\"\",'FY25-26 Work Plan'!$E$18:$E$18)","v":"John/Jane Doe"},{"$f":"IF(ISBLANK('FY25-26 Work Plan'!$I$18:$I$18),\"\",TEXT('FY25-26 Work Plan'!$I$18:$I$18,\"###-###-####\"))","v":"213-555-1213"},{"$f":"IF(ISBLANK('FY25-26 Work Plan'!$L$18:$L$18),\"\",'FY25-26 Work Plan'!$L$18:$L$18)","v":"j.doe@preventionusa.com"},{"$f":"IF(ISBLANK('FY25-26 Work Plan'!$E$19:$E$19),\"\",'FY25-26 Work Plan'!$E$19:$E$19)","v":"John/Jane Doe"},{"$f":"IF(ISBLANK('FY25-26 Work Plan'!$I$19:$I$19),\"\",TEXT('FY25-26 Work Plan'!$I$19:$I$19,\"###-###-####\"))","v":"213-555-1213"},{"$f":"IF(ISBLANK('FY25-26 Work Plan'!$L$19:$L$19),\"\",'FY25-26 Work Plan'!$L$19:$L$19)","v":"j.doe@preventionusa.com"},{"$f":"IF(ISBLANK('FY25-26 Work Plan'!$E$23:$E$23),\"\",'FY25-26 Work Plan'!$E$23:$E$23)","v":""},{"$f":"IF(ISBLANK('FY25-26 Work Plan'!$I$23:$I$23),\"\",'FY25-26 Work Plan'!$I$23:$I$23)","v":""},{"$f":"IF(ISBLANK('FY25-26 Work Plan'!$E$24:$E$24),\"\",'FY25-26 Work Plan'!$E$24:$E$24)","v":""},{"$f":"IF(ISBLANK('FY25-26 Work Plan'!$I$24:$I$24),\"\",'FY25-26 Work Plan'!$I$24:$I$24)","v":""},{"$f":"IF(ISBLANK('FY25-26 Work Plan'!$E$25:$E$25),\"\",'FY25-26 Work Plan'!$E$25:$E$25)","v":""},{"$f":"IF(ISBLANK('FY25-26 Work Plan'!$I$25:$I$25),\"\",'FY25-26 Work Plan'!$I$25:$I$25)","v":""},{"$f":"IF(ISBLANK('FY25-26 Work Plan'!$E$26:$E$26),\"\",'FY25-26 Work Plan'!$E$26:$E$26)","v":""},{"$f":"IF(ISBLANK('FY25-26 Work Plan'!$I$26:$I$26),\"\",'FY25-26 Work Plan'!$I$26:$I$26)","v":""},{"$f":"IF(ISBLANK('FY25-26 Work Plan'!$E$27:$E$27),\"\",'FY25-26 Work Plan'!$E$27:$E$27)","v":""},{"$f":"IF(ISBLANK('FY25-26 Work Plan'!$I$27:$I$27),\"\",'FY25-26 Work Plan'!$I$27:$I$27)","v":""},{"$f":"IF(ISBLANK('FY25-26 Work Plan'!$E$28:$E$28),\"\",'FY25-26 Work Plan'!$E$28:$E$28)","v":""},{"$f":"IF(ISBLANK('FY25-26 Work Plan'!$I$28:$I$28),\"\",'FY25-26 Work Plan'!$I$28:$I$28)","v":""},{"$f":"IF(ISBLANK('FY25-26 Work Plan'!$E$29:$E$29),\"\",'FY25-26 Work Plan'!$E$29:$E$29)","v":""},{"$f":"IF(ISBLANK('FY25-26 Work Plan'!$I$29:$I$29),\"\",'FY25-26 Work Plan'!$I$29:$I$29)","v":""},{"$f":"IF(ISBLANK('FY25-26 Work Plan'!$B$30:$B$30),\"\",'FY25-26 Work Plan'!$B$30:$B$30)","v":""},{"$f":"IF(ISBLANK('FY25-26 Work Plan'!$E$30:$E$30),\"\",'FY25-26 Work Plan'!$E$30:$E$30)","v":""},{"$f":"IF(ISBLANK('FY25-26 Work Plan'!$I$30:$I$30),\"\",'FY25-26 Work Plan'!$I$30:$I$30)","v":""},{"$f":"IF(ISBLANK('FY25-26 Work Plan'!$B$31:$B$31),\"\",'FY25-26 Work Plan'!$B$31:$B$31)","v":""},{"$f":"IF(ISBLANK('FY25-26 Work Plan'!$E$31:$E$31),\"\",'FY25-26 Work Plan'!$E$31:$E$31)","v":""},{"$f":"IF(ISBLANK('FY25-26 Work Plan'!$I$31:$I$31),\"\",'FY25-26 Work Plan'!$I$31:$I$31)","v":""},{"$f":"IF(ISBLANK('FY25-26 Work Plan'!$B$32:$B$32),\"\",'FY25-26 Work Plan'!$B$32:$B$32)","v":""},{"$f":"IF(ISBLANK('FY25-26 Work Plan'!$E$32:$E$32),\"\",'FY25-26 Work Plan'!$E$32:$E$32)","v":""},{"$f":"IF(ISBLANK('FY25-26 Work Plan'!$I$32:$I$32),\"\",'FY25-26 Work Plan'!$I$32:$I$32)","v":""},{"$f":"IF(ISBLANK('FY25-26 Work Plan'!#REF!),\"\",'FY25-26 Work Plan'!#REF!)","v":{"$error":"#REF!"}},{"$f":"IF(ISBLANK('FY25-26 Work Plan'!#REF!),\"\",'FY25-26 Work Plan'!#REF!)","v":{"$error":"#REF!"}},{"$f":"IF(ISBLANK('FY25-26 Work Plan'!#REF!),\"\",'FY25-26 Work Plan'!#REF!)","v":{"$error":"#REF!"}},{"$f":"IF(ISBLANK('FY25-26 Work Plan'!#REF!),\"\",'FY25-26 Work Plan'!#REF!)","v":{"$error":"#REF!"}},{"$f":"IF(ISBLANK('FY25-26 Work Plan'!#REF!),\"\",'FY25-26 Work Plan'!#REF!)","v":{"$error":"#REF!"}},{"$f":"IF(ISBLANK('FY25-26 Work Plan'!#REF!),\"\",'FY25-26 Work Plan'!#REF!)","v":{"$error":"#REF!"}},{"$f":"IF(ISBLANK('FY25-26 Work Plan'!#REF!),\"\",'FY25-26 Work Plan'!#REF!)","v":{"$error":"#REF!"}},{"$f":"IF(ISBLANK('FY25-26 Work Plan'!#REF!),\"\",'FY25-26 Work Plan'!#REF!)","v":{"$error":"#REF!"}},{"$f":"IF(ISBLANK('FY25-26 Work Plan'!#REF!),\"\",'FY25-26 Work Plan'!#REF!)","v":{"$error":"#REF!"}}]
[{"$f":"IF(ISBLANK('FY25-26 Work Plan'!$E$2:$E$2),\"\",'FY25-26 Work Plan'!$E$2:$E$2)","v":"Asian American Drug Abuse Programs, Inc. (AADAP)"},{"$f":"IF(ISBLANK('FY25-26 Work Plan'!$L$2:$L$2),\"\",'FY25-26 Work Plan'!$L$2:$L$2)","v":"Prevention Education Program (PEP)"},{"$f":"IF(ISBLANK('FY25-26 Work Plan'!$L$3:$L$3),\"\",'FY25-26 Work Plan'!$L$3:$L$3)","v":""},{"$f":"IF(ISBLANK('FY25-26 Work Plan'!$E$3:$E$3),\"\",'FY25-26 Work Plan'!$E$3:$E$3)","v":"PH-005150 "},{"$f":"IF(ISBLANK('FY25-26 Work Plan'!$E$4:$E$4),\"\",TEXT('FY25-26 Work Plan'!$E$4:$E$4,\"000000\"))","v":"000001"},{"$f":"IF(ISBLANK('FY25-26 Work Plan'!$L$4:$L$4),\"\",'FY25-26 Work Plan'!$L$4:$L$4)","v":""},{"$f":"IF(ISBLANK('FY25-26 Work Plan'!$E$5:$E$5),\"\",'FY25-26 Work Plan'!$E$5:$E$5)","v":"2 - San Fernando Valley"},{"$f":"IF(ISBLANK('FY25-26 Work Plan'!$L$5:$L$5),\"\",'FY25-26 Work Plan'!$L$5:$L$5)","v":""},{"$f":"IF(ISBLANK('FY25-26 Work Plan'!$E$6:$E$6),\"\",'FY25-26 Work Plan'!$E$6:$E$6)","v":"Agoura Hills, Agua Dulce*"},{"$f":"IF(ISBLANK('FY25-26 Work Plan'!$F$7:$F$7),\"\",'FY25-26 Work Plan'!$F$7:$F$7)","v":""},{"$f":"IF(ISBLANK('FY25-26 Work Plan'!$F$8:$F$8),\"\",'FY25-26 Work Plan'!$F$8:$F$8)","v":""},{"$f":"IF(ISBLANK('FY25-26 Work Plan'!$E$9:$E$9),\"\",'FY25-26 Work Plan'!$E$9:$E$9)","v":"123 E Main St., Suite 100 \nAnytown, CA 90000"},{"$f":"IF(ISBLANK('FY25-26 Work Plan'!$L$9:$L$9),\"\",TEXT('FY25-26 Work Plan'!$L$9:$L$9,\"###-###-####\"))","v":"999-999-9999"},{"$f":"IF(ISBLANK('FY25-26 Work Plan'!$L$10:$L$10),\"\",'FY25-26 Work Plan'!$L$10:$L$10)","v":"www.abc1.org"},{"$f":"IF(ISBLANK('FY25-26 Work Plan'!$E$11:$E$11),\"\",'FY25-26 Work Plan'!$E$11:$E$11)","v":"123 E Main St., Suite 100 \nAnytown, CA 90000"},{"$f":"IF(ISBLANK('FY25-26 Work Plan'!$L$11:$L$11),\"\",TEXT('FY25-26 Work Plan'!$L$11:$L$11,\"###-###-####\"))","v":"999-999-9999"},{"$f":"IF(ISBLANK('FY25-26 Work Plan'!$L$12:$L$12),\"\",'FY25-26 Work Plan'!$L$12:$L$12)","v":"www.abc2.org"},{"$f":"IF(ISBLANK('FY25-26 Work Plan'!$E$15:$E$15),\"\",'FY25-26 Work Plan'!$E$15:$E$15)","v":"John/Jane Doe"},{"$f":"IF(ISBLANK('FY25-26 Work Plan'!$I$15:$I$15),\"\",TEXT('FY25-26 Work Plan'!$I$15:$I$15,\"###-###-####\"))","v":"213-555-1212"},{"$f":"IF(ISBLANK('FY25-26 Work Plan'!$L$15:$L$15),\"\",'FY25-26 Work Plan'!$L$15:$L$15)","v":"janedoe@preventionusa.com"},{"$f":"IF(ISBLANK('FY25-26 Work Plan'!$E$16:$E$16),\"\",'FY25-26 Work Plan'!$E$16:$E$16)","v":"John/Jane Doe"},{"$f":"IF(ISBLANK('FY25-26 Work Plan'!$I$16:$I$16),\"\",TEXT('FY25-26 Work Plan'!$I$16:$I$16,\"###-###-####\"))","v":"213-555-1212"},{"$f":"IF(ISBLANK('FY25-26 Work Plan'!$L$16:$L$16),\"\",'FY25-26 Work Plan'!$L$16:$L$16)","v":"janedoe@preventionusa.com"},{"$f":"IF(ISBLANK('FY25-26 Work Plan'!$E$17:$E$17),\"\",'FY25-26 Work Plan'!$E$17:$E$17)","v":"John/Jane Doe"},{"$f":"IF(ISBLANK('FY25-26 Work Plan'!$I$17:$I$17),\"\",TEXT('FY25-26 Work Plan'!$I$17:$I$17,\"###-###-####\"))","v":"213-555-1212"},{"$f":"IF(ISBLANK('FY25-26 Work Plan'!$L$17:$L$17),\"\",'FY25-26 Work Plan'!$L$17:$L$17)","v":"j.doe@preventionusa.com"},{"$f":"IF(ISBLANK('FY25-26 Work Plan'!$E$18:$E$18),\"\",'FY25-26 Work Plan'!$E$18:$E$18)","v":"John/Jane Doe"},{"$f":"IF(ISBLANK('FY25-26 Work Plan'!$I$18:$I$18),\"\",TEXT('FY25-26 Work Plan'!$I$18:$I$18,\"###-###-####\"))","v":"213-555-1213"},{"$f":"IF(ISBLANK('FY25-26 Work Plan'!$L$18:$L$18),\"\",'FY25-26 Work Plan'!$L$18:$L$18)","v":"j.doe@preventionusa.com"},{"$f":"IF(ISBLANK('FY25-26 Work Plan'!$E$19:$E$19),\"\",'FY25-26 Work Plan'!$E$19:$E$19)","v":"John/Jane Doe"},{"$f":"IF(ISBLANK('FY25-26 Work Plan'!$I$19:$I$19),\"\",TEXT('FY25-26 Work Plan'!$I$19:$I$19,\"###-###-####\"))","v":"213-555-1213"},{"$f":"IF(ISBLANK('FY25-26 Work Plan'!$L$19:$L$19),\"\",'FY25-26 Work Plan'!$L$19:$L$19)","v":"j.doe@preventionusa.com"},{"$f":"IF(ISBLANK('FY25-26 Work Plan'!$E$23:$E$23),\"\",'FY25-26 Work Plan'!$E$23:$E$23)","v":""},{"$f":"IF(ISBLANK('FY25-26 Work Plan'!$I$23:$I$23),\"\",'FY25-26 Work Plan'!$I$23:$I$23)","v":""},{"$f":"IF(ISBLANK('FY25-26 Work Plan'!$E$24:$E$24),\"\",'FY25-26 Work Plan'!$E$24:$E$24)","v":""},{"$f":"IF(ISBLANK('FY25-26 Work Plan'!$I$24:$I$24),\"\",'FY25-26 Work Plan'!$I$24:$I$24)","v":""},{"$f":"IF(ISBLANK('FY25-26 Work Plan'!$E$25:$E$25),\"\",'FY25-26 Work Plan'!$E$25:$E$25)","v":""},{"$f":"IF(ISBLANK('FY25-26 Work Plan'!$I$25:$I$25),\"\",'FY25-26 Work Plan'!$I$25:$I$25)","v":""},{"$f":"IF(ISBLANK('FY25-26 Work Plan'!$E$26:$E$26),\"\",'FY25-26 Work Plan'!$E$26:$E$26)","v":""},{"$f":"IF(ISBLANK('FY25-26 Work Plan'!$I$26:$I$26),\"\",'FY25-26 Work Plan'!$I$26:$I$26)","v":""},{"$f":"IF(ISBLANK('FY25-26 Work Plan'!$E$27:$E$27),\"\",'FY25-26 Work Plan'!$E$27:$E$27)","v":""},{"$f":"IF(ISBLANK('FY25-26 Work Plan'!$I$27:$I$27),\"\",'FY25-26 Work Plan'!$I$27:$I$27)","v":""},{"$f":"IF(ISBLANK('FY25-26 Work Plan'!$E$28:$E$28),\"\",'FY25-26 Work Plan'!$E$28:$E$28)","v":""},{"$f":"IF(ISBLANK('FY25-26 Work Plan'!$I$28:$I$28),\"\",'FY25-26 Work Plan'!$I$28:$I$28)","v":""},{"$f":"IF(ISBLANK('FY25-26 Work Plan'!$E$29:$E$29),\"\",'FY25-26 Work Plan'!$E$29:$E$29)","v":""},{"$f":"IF(ISBLANK('FY25-26 Work Plan'!$I$29:$I$29),\"\",'FY25-26 Work Plan'!$I$29:$I$29)","v":""},{"$f":"IF(ISBLANK('FY25-26 Work Plan'!$B$30:$B$30),\"\",'FY25-26 Work Plan'!$B$30:$B$30)","v":""},{"$f":"IF(ISBLANK('FY25-26 Work Plan'!$E$30:$E$30),\"\",'FY25-26 Work Plan'!$E$30:$E$30)","v":""},{"$f":"IF(ISBLANK('FY25-26 Work Plan'!$I$30:$I$30),\"\",'FY25-26 Work Plan'!$I$30:$I$30)","v":""},{"$f":"IF(ISBLANK('FY25-26 Work Plan'!$B$31:$B$31),\"\",'FY25-26 Work Plan'!$B$31:$B$31)","v":""},{"$f":"IF(ISBLANK('FY25-26 Work Plan'!$E$31:$E$31),\"\",'FY25-26 Work Plan'!$E$31:$E$31)","v":""},{"$f":"IF(ISBLANK('FY25-26 Work Plan'!$I$31:$I$31),\"\",'FY25-26 Work Plan'!$I$31:$I$31)","v":""},{"$f":"IF(ISBLANK('FY25-26 Work Plan'!$B$32:$B$32),\"\",'FY25-26 Work Plan'!$B$32:$B$32)","v":""},{"$f":"IF(ISBLANK('FY25-26 Work Plan'!$E$32:$E$32),\"\",'FY25-26 Work Plan'!$E$32:$E$32)","v":""},{"$f":"IF(ISBLANK('FY25-26 Work Plan'!$I$32:$I$32),\"\",'FY25-26 Work Plan'!$I$32:$I$32)","v":""},{"$f":"IF(ISBLANK('FY25-26 Work Plan'!#REF!),\"\",'FY25-26 Work Plan'!#REF!)","v":{"$error":"#REF!"}},{"$f":"IF(ISBLANK('FY25-26 Work Plan'!#REF!),\"\",'FY25-26 Work Plan'!#REF!)","v":{"$error":"#REF!"}},{"$f":"IF(ISBLANK('FY25-26 Work Plan'!#REF!),\"\",'FY25-26 Work Plan'!#REF!)","v":{"$error":"#REF!"}},{"$f":"IF(ISBLANK('FY25-26 Work Plan'!#REF!),\"\",'FY25-26 Work Plan'!#REF!)","v":{"$error":"#REF!"}},{"$f":"IF(ISBLANK('FY25-26 Work Plan'!#REF!),\"\",'FY25-26 Work Plan'!#REF!)","v":{"$error":"#REF!"}},{"$f":"IF(ISBLANK('FY25-26 Work Plan'!#REF!),\"\",'FY25-26 Work Plan'!#REF!)","v":{"$error":"#REF!"}},{"$f":"IF(ISBLANK('FY25-26 Work Plan'!#REF!),\"\",'FY25-26 Work Plan'!#REF!)","v":{"$error":"#REF!"}},{"$f":"IF(ISBLANK('FY25-26 Work Plan'!#REF!),\"\",'FY25-26 Work Plan'!#REF!)","v":{"$error":"#REF!"}},{"$f":"IF(ISBLANK('FY25-26 Work Plan'!#REF!),\"\",'FY25-26 Work Plan'!#REF!)","v":{"$error":"#REF!"}}]
[{"$f":"IF(ISBLANK('FY25-26 Work Plan'!$E$2:$E$2),\"\",'FY25-26 Work Plan'!$E$2:$E$2)","v":"Asian American Drug Abuse Programs, Inc. (AADAP)"},{"$f":"IF(ISBLANK('FY25-26 Work Plan'!$L$2:$L$2),\"\",'FY25-26 Work Plan'!$L$2:$L$2)","v":"Prevention Education Program (PEP)"},{"$f":"IF(ISBLANK('FY25-26 Work Plan'!$L$3:$L$3),\"\",'FY25-26 Work Plan'!$L$3:$L$3)","v":""},{"$f":"IF(ISBLANK('FY25-26 Work Plan'!$E$3:$E$3),\"\",'FY25-26 Work Plan'!$E$3:$E$3)","v":"PH-005150 "},{"$f":"IF(ISBLANK('FY25-26 Work Plan'!$E$4:$E$4),\"\",TEXT('FY25-26 Work Plan'!$E$4:$E$4,\"000000\"))","v":"000001"},{"$f":"IF(ISBLANK('FY25-26 Work Plan'!$L$4:$L$4),\"\",'FY25-26 Work Plan'!$L$4:$L$4)","v":""},{"$f":"IF(ISBLANK('FY25-26 Work Plan'!$E$5:$E$5),\"\",'FY25-26 Work Plan'!$E$5:$E$5)","v":"2 - San Fernando Valley"},{"$f":"IF(ISBLANK('FY25-26 Work Plan'!$L$5:$L$5),\"\",'FY25-26 Work Plan'!$L$5:$L$5)","v":""},{"$f":"IF(ISBLANK('FY25-26 Work Plan'!$E$6:$E$6),\"\",'FY25-26 Work Plan'!$E$6:$E$6)","v":"Agoura Hills, Agua Dulce*"},{"$f":"IF(ISBLANK('FY25-26 Work Plan'!$F$7:$F$7),\"\",'FY25-26 Work Plan'!$F$7:$F$7)","v":""},{"$f":"IF(ISBLANK('FY25-26 Work Plan'!$F$8:$F$8),\"\",'FY25-26 Work Plan'!$F$8:$F$8)","v":""},{"$f":"IF(ISBLANK('FY25-26 Work Plan'!$E$9:$E$9),\"\",'FY25-26 Work Plan'!$E$9:$E$9)","v":"123 E Main St., Suite 100 \nAnytown, CA 90000"},{"$f":"IF(ISBLANK('FY25-26 Work Plan'!$L$9:$L$9),\"\",TEXT('FY25-26 Work Plan'!$L$9:$L$9,\"###-###-####\"))","v":"999-999-9999"},{"$f":"IF(ISBLANK('FY25-26 Work Plan'!$L$10:$L$10),\"\",'FY25-26 Work Plan'!$L$10:$L$10)","v":"www.abc1.org"},{"$f":"IF(ISBLANK('FY25-26 Work Plan'!$E$11:$E$11),\"\",'FY25-26 Work Plan'!$E$11:$E$11)","v":"123 E Main St., Suite 100 \nAnytown, CA 90000"},{"$f":"IF(ISBLANK('FY25-26 Work Plan'!$L$11:$L$11),\"\",TEXT('FY25-26 Work Plan'!$L$11:$L$11,\"###-###-####\"))","v":"999-999-9999"},{"$f":"IF(ISBLANK('FY25-26 Work Plan'!$L$12:$L$12),\"\",'FY25-26 Work Plan'!$L$12:$L$12)","v":"www.abc2.org"},{"$f":"IF(ISBLANK('FY25-26 Work Plan'!$E$15:$E$15),\"\",'FY25-26 Work Plan'!$E$15:$E$15)","v":"John/Jane Doe"},{"$f":"IF(ISBLANK('FY25-26 Work Plan'!$I$15:$I$15),\"\",TEXT('FY25-26 Work Plan'!$I$15:$I$15,\"###-###-####\"))","v":"213-555-1212"},{"$f":"IF(ISBLANK('FY25-26 Work Plan'!$L$15:$L$15),\"\",'FY25-26 Work Plan'!$L$15:$L$15)","v":"janedoe@preventionusa.com"},{"$f":"IF(ISBLANK('FY25-26 Work Plan'!$E$16:$E$16),\"\",'FY25-26 Work Plan'!$E$16:$E$16)","v":"John/Jane Doe"},{"$f":"IF(ISBLANK('FY25-26 Work Plan'!$I$16:$I$16),\"\",TEXT('FY25-26 Work Plan'!$I$16:$I$16,\"###-###-####\"))","v":"213-555-1212"},{"$f":"IF(ISBLANK('FY25-26 Work Plan'!$L$16:$L$16),\"\",'FY25-26 Work Plan'!$L$16:$L$16)","v":"janedoe@preventionusa.com"},{"$f":"IF(ISBLANK('FY25-26 Work Plan'!$E$17:$E$17),\"\",'FY25-26 Work Plan'!$E$17:$E$17)","v":"John/Jane Doe"},{"$f":"IF(ISBLANK('FY25-26 Work Plan'!$I$17:$I$17),\"\",TEXT('FY25-26 Work Plan'!$I$17:$I$17,\"###-###-####\"))","v":"213-555-1212"},{"$f":"IF(ISBLANK('FY25-26 Work Plan'!$L$17:$L$17),\"\",'FY25-26 Work Plan'!$L$17:$L$17)","v":"j.doe@preventionusa.com"},{"$f":"IF(ISBLANK('FY25-26 Work Plan'!$E$18:$E$18),\"\",'FY25-26 Work Plan'!$E$18:$E$18)","v":"John/Jane Doe"},{"$f":"IF(ISBLANK('FY25-26 Work Plan'!$I$18:$I$18),\"\",TEXT('FY25-26 Work Plan'!$I$18:$I$18,\"###-###-####\"))","v":"213-555-1213"},{"$f":"IF(ISBLANK('FY25-26 Work Plan'!$L$18:$L$18),\"\",'FY25-26 Work Plan'!$L$18:$L$18)","v":"j.doe@preventionusa.com"},{"$f":"IF(ISBLANK('FY25-26 Work Plan'!$E$19:$E$19),\"\",'FY25-26 Work Plan'!$E$19:$E$19)","v":"John/Jane Doe"},{"$f":"IF(ISBLANK('FY25-26 Work Plan'!$I$19:$I$19),\"\",TEXT('FY25-26 Work Plan'!$I$19:$I$19,\"###-###-####\"))","v":"213-555-1213"},{"$f":"IF(ISBLANK('FY25-26 Work Plan'!$L$19:$L$19),\"\",'FY25-26 Work Plan'!$L$19:$L$19)","v":"j.doe@preventionusa.com"},{"$f":"IF(ISBLANK('FY25-26 Work Plan'!$E$23:$E$23),\"\",'FY25-26 Work Plan'!$E$23:$E$23)","v":""},{"$f":"IF(ISBLANK('FY25-26 Work Plan'!$I$23:$I$23),\"\",'FY25-26 Work Plan'!$I$23:$I$23)","v":""},{"$f":"IF(ISBLANK('FY25-26 Work Plan'!$E$24:$E$24),\"\",'FY25-26 Work Plan'!$E$24:$E$24)","v":""},{"$f":"IF(ISBLANK('FY25-26 Work Plan'!$I$24:$I$24),\"\",'FY25-26 Work Plan'!$I$24:$I$24)","v":""},{"$f":"IF(ISBLANK('FY25-26 Work Plan'!$E$25:$E$25),\"\",'FY25-26 Work Plan'!$E$25:$E$25)","v":""},{"$f":"IF(ISBLANK('FY25-26 Work Plan'!$I$25:$I$25),\"\",'FY25-26 Work Plan'!$I$25:$I$25)","v":""},{"$f":"IF(ISBLANK('FY25-26 Work Plan'!$E$26:$E$26),\"\",'FY25-26 Work Plan'!$E$26:$E$26)","v":""},{"$f":"IF(ISBLANK('FY25-26 Work Plan'!$I$26:$I$26),\"\",'FY25-26 Work Plan'!$I$26:$I$26)","v":""},{"$f":"IF(ISBLANK('FY25-26 Work Plan'!$E$27:$E$27),\"\",'FY25-26 Work Plan'!$E$27:$E$27)","v":""},{"$f":"IF(ISBLANK('FY25-26 Work Plan'!$I$27:$I$27),\"\",'FY25-26 Work Plan'!$I$27:$I$27)","v":""},{"$f":"IF(ISBLANK('FY25-26 Work Plan'!$E$28:$E$28),\"\",'FY25-26 Work Plan'!$E$28:$E$28)","v":""},{"$f":"IF(ISBLANK('FY25-26 Work Plan'!$I$28:$I$28),\"\",'FY25-26 Work Plan'!$I$28:$I$28)","v":""},{"$f":"IF(ISBLANK('FY25-26 Work Plan'!$E$29:$E$29),\"\",'FY25-26 Work Plan'!$E$29:$E$29)","v":""},{"$f":"IF(ISBLANK('FY25-26 Work Plan'!$I$29:$I$29),\"\",'FY25-26 Work Plan'!$I$29:$I$29)","v":""},{"$f":"IF(ISBLANK('FY25-26 Work Plan'!$B$30:$B$30),\"\",'FY25-26 Work Plan'!$B$30:$B$30)","v":""},{"$f":"IF(ISBLANK('FY25-26 Work Plan'!$E$30:$E$30),\"\",'FY25-26 Work Plan'!$E$30:$E$30)","v":""},{"$f":"IF(ISBLANK('FY25-26 Work Plan'!$I$30:$I$30),\"\",'FY25-26 Work Plan'!$I$30:$I$30)","v":""},{"$f":"IF(ISBLANK('FY25-26 Work Plan'!$B$31:$B$31),\"\",'FY25-26 Work Plan'!$B$31:$B$31)","v":""},{"$f":"IF(ISBLANK('FY25-26 Work Plan'!$E$31:$E$31),\"\",'FY25-26 Work Plan'!$E$31:$E$31)","v":""},{"$f":"IF(ISBLANK('FY25-26 Work Plan'!$I$31:$I$31),\"\",'FY25-26 Work Plan'!$I$31:$I$31)","v":""},{"$f":"IF(ISBLANK('FY25-26 Work Plan'!$B$32:$B$32),\"\",'FY25-26 Work Plan'!$B$32:$B$32)","v":""},{"$f":"IF(ISBLANK('FY25-26 Work Plan'!$E$32:$E$32),\"\",'FY25-26 Work Plan'!$E$32:$E$32)","v":""},{"$f":"IF(ISBLANK('FY25-26 Work Plan'!$I$32:$I$32),\"\",'FY25-26 Work Plan'!$I$32:$I$32)","v":""},{"$f":"IF(ISBLANK('FY25-26 Work Plan'!#REF!),\"\",'FY25-26 Work Plan'!#REF!)","v":{"$error":"#REF!"}},{"$f":"IF(ISBLANK('FY25-26 Work Plan'!#REF!),\"\",'FY25-26 Work Plan'!#REF!)","v":{"$error":"#REF!"}},{"$f":"IF(ISBLANK('FY25-26 Work Plan'!#REF!),\"\",'FY25-26 Work Plan'!#REF!)","v":{"$error":"#REF!"}},{"$f":"IF(ISBLANK('FY25-26 Work Plan'!#REF!),\"\",'FY25-26 Work Plan'!#REF!)","v":{"$error":"#REF!"}},{"$f":"IF(ISBLANK('FY25-26 Work Plan'!#REF!),\"\",'FY25-26 Work Plan'!#REF!)","v":{"$error":"#REF!"}},{"$f":"IF(ISBLANK('FY25-26 Work Plan'!#REF!),\"\",'FY25-26 Work Plan'!#REF!)","v":{"$error":"#REF!"}},{"$f":"IF(ISBLANK('FY25-26 Work Plan'!#REF!),\"\",'FY25-26 Work Plan'!#REF!)","v":{"$error":"#REF!"}},{"$f":"IF(ISBLANK('FY25-26 Work Plan'!#REF!),\"\",'FY25-26 Work Plan'!#REF!)","v":{"$error":"#REF!"}},{"$f":"IF(ISBLANK('FY25-26 Work Plan'!#REF!),\"\",'FY25-26 Work Plan'!#REF!)","v":{"$error":"#REF!"}}]
[{"$f":"IF(ISBLANK('FY25-26 Work Plan'!$E$2:$E$2),\"\",'FY25-26 Work Plan'!$E$2:$E$2)","v":"Asian American Drug Abuse Programs, Inc. (AADAP)"},{"$f":"IF(ISBLANK('FY25-26 Work Plan'!$L$2:$L$2),\"\",'FY25-26 Work Plan'!$L$2:$L$2)","v":"Prevention Education Program (PEP)"},{"$f":"IF(ISBLANK('FY25-26 Work Plan'!$L$3:$L$3),\"\",'FY25-26 Work Plan'!$L$3:$L$3)","v":""},{"$f":"IF(ISBLANK('FY25-26 Work Plan'!$E$3:$E$3),\"\",'FY25-26 Work Plan'!$E$3:$E$3)","v":"PH-005150 "},{"$f":"IF(ISBLANK('FY25-26 Work Plan'!$E$4:$E$4),\"\",TEXT('FY25-26 Work Plan'!$E$4:$E$4,\"000000\"))","v":"000001"},{"$f":"IF(ISBLANK('FY25-26 Work Plan'!$L$4:$L$4),\"\",'FY25-26 Work Plan'!$L$4:$L$4)","v":""},{"$f":"IF(ISBLANK('FY25-26 Work Plan'!$E$5:$E$5),\"\",'FY25-26 Work Plan'!$E$5:$E$5)","v":"2 - San Fernando Valley"},{"$f":"IF(ISBLANK('FY25-26 Work Plan'!$L$5:$L$5),\"\",'FY25-26 Work Plan'!$L$5:$L$5)","v":""},{"$f":"IF(ISBLANK('FY25-26 Work Plan'!$E$6:$E$6),\"\",'FY25-26 Work Plan'!$E$6:$E$6)","v":"Agoura Hills, Agua Dulce*"},{"$f":"IF(ISBLANK('FY25-26 Work Plan'!$F$7:$F$7),\"\",'FY25-26 Work Plan'!$F$7:$F$7)","v":""},{"$f":"IF(ISBLANK('FY25-26 Work Plan'!$F$8:$F$8),\"\",'FY25-26 Work Plan'!$F$8:$F$8)","v":""},{"$f":"IF(ISBLANK('FY25-26 Work Plan'!$E$9:$E$9),\"\",'FY25-26 Work Plan'!$E$9:$E$9)","v":"123 E Main St., Suite 100 \nAnytown, CA 90000"},{"$f":"IF(ISBLANK('FY25-26 Work Plan'!$L$9:$L$9),\"\",TEXT('FY25-26 Work Plan'!$L$9:$L$9,\"###-###-####\"))","v":"999-999-9999"},{"$f":"IF(ISBLANK('FY25-26 Work Plan'!$L$10:$L$10),\"\",'FY25-26 Work Plan'!$L$10:$L$10)","v":"www.abc1.org"},{"$f":"IF(ISBLANK('FY25-26 Work Plan'!$E$11:$E$11),\"\",'FY25-26 Work Plan'!$E$11:$E$11)","v":"123 E Main St., Suite 100 \nAnytown, CA 90000"},{"$f":"IF(ISBLANK('FY25-26 Work Plan'!$L$11:$L$11),\"\",TEXT('FY25-26 Work Plan'!$L$11:$L$11,\"###-###-####\"))","v":"999-999-9999"},{"$f":"IF(ISBLANK('FY25-26 Work Plan'!$L$12:$L$12),\"\",'FY25-26 Work Plan'!$L$12:$L$12)","v":"www.abc2.org"},{"$f":"IF(ISBLANK('FY25-26 Work Plan'!$E$15:$E$15),\"\",'FY25-26 Work Plan'!$E$15:$E$15)","v":"John/Jane Doe"},{"$f":"IF(ISBLANK('FY25-26 Work Plan'!$I$15:$I$15),\"\",TEXT('FY25-26 Work Plan'!$I$15:$I$15,\"###-###-####\"))","v":"213-555-1212"},{"$f":"IF(ISBLANK('FY25-26 Work Plan'!$L$15:$L$15),\"\",'FY25-26 Work Plan'!$L$15:$L$15)","v":"janedoe@preventionusa.com"},{"$f":"IF(ISBLANK('FY25-26 Work Plan'!$E$16:$E$16),\"\",'FY25-26 Work Plan'!$E$16:$E$16)","v":"John/Jane Doe"},{"$f":"IF(ISBLANK('FY25-26 Work Plan'!$I$16:$I$16),\"\",TEXT('FY25-26 Work Plan'!$I$16:$I$16,\"###-###-####\"))","v":"213-555-1212"},{"$f":"IF(ISBLANK('FY25-26 Work Plan'!$L$16:$L$16),\"\",'FY25-26 Work Plan'!$L$16:$L$16)","v":"janedoe@preventionusa.com"},{"$f":"IF(ISBLANK('FY25-26 Work Plan'!$E$17:$E$17),\"\",'FY25-26 Work Plan'!$E$17:$E$17)","v":"John/Jane Doe"},{"$f":"IF(ISBLANK('FY25-26 Work Plan'!$I$17:$I$17),\"\",TEXT('FY25-26 Work Plan'!$I$17:$I$17,\"###-###-####\"))","v":"213-555-1212"},{"$f":"IF(ISBLANK('FY25-26 Work Plan'!$L$17:$L$17),\"\",'FY25-26 Work Plan'!$L$17:$L$17)","v":"j.doe@preventionusa.com"},{"$f":"IF(ISBLANK('FY25-26 Work Plan'!$E$18:$E$18),\"\",'FY25-26 Work Plan'!$E$18:$E$18)","v":"John/Jane Doe"},{"$f":"IF(ISBLANK('FY25-26 Work Plan'!$I$18:$I$18),\"\",TEXT('FY25-26 Work Plan'!$I$18:$I$18,\"###-###-####\"))","v":"213-555-1213"},{"$f":"IF(ISBLANK('FY25-26 Work Plan'!$L$18:$L$18),\"\",'FY25-26 Work Plan'!$L$18:$L$18)","v":"j.doe@preventionusa.com"},{"$f":"IF(ISBLANK('FY25-26 Work Plan'!$E$19:$E$19),\"\",'FY25-26 Work Plan'!$E$19:$E$19)","v":"John/Jane Doe"},{"$f":"IF(ISBLANK('FY25-26 Work Plan'!$I$19:$I$19),\"\",TEXT('FY25-26 Work Plan'!$I$19:$I$19,\"###-###-####\"))","v":"213-555-1213"},{"$f":"IF(ISBLANK('FY25-26 Work Plan'!$L$19:$L$19),\"\",'FY25-26 Work Plan'!$L$19:$L$19)","v":"j.doe@preventionusa.com"},{"$f":"IF(ISBLANK('FY25-26 Work Plan'!$E$23:$E$23),\"\",'FY25-26 Work Plan'!$E$23:$E$23)","v":""},{"$f":"IF(ISBLANK('FY25-26 Work Plan'!$I$23:$I$23),\"\",'FY25-26 Work Plan'!$I$23:$I$23)","v":""},{"$f":"IF(ISBLANK('FY25-26 Work Plan'!$E$24:$E$24),\"\",'FY25-26 Work Plan'!$E$24:$E$24)","v":""},{"$f":"IF(ISBLANK('FY25-26 Work Plan'!$I$24:$I$24),\"\",'FY25-26 Work Plan'!$I$24:$I$24)","v":""},{"$f":"IF(ISBLANK('FY25-26 Work Plan'!$E$25:$E$25),\"\",'FY25-26 Work Plan'!$E$25:$E$25)","v":""},{"$f":"IF(ISBLANK('FY25-26 Work Plan'!$I$25:$I$25),\"\",'FY25-26 Work Plan'!$I$25:$I$25)","v":""},{"$f":"IF(ISBLANK('FY25-26 Work Plan'!$E$26:$E$26),\"\",'FY25-26 Work Plan'!$E$26:$E$26)","v":""},{"$f":"IF(ISBLANK('FY25-26 Work Plan'!$I$26:$I$26),\"\",'FY25-26 Work Plan'!$I$26:$I$26)","v":""},{"$f":"IF(ISBLANK('FY25-26 Work Plan'!$E$27:$E$27),\"\",'FY25-26 Work Plan'!$E$27:$E$27)","v":""},{"$f":"IF(ISBLANK('FY25-26 Work Plan'!$I$27:$I$27),\"\",'FY25-26 Work Plan'!$I$27:$I$27)","v":""},{"$f":"IF(ISBLANK('FY25-26 Work Plan'!$E$28:$E$28),\"\",'FY25-26 Work Plan'!$E$28:$E$28)","v":""},{"$f":"IF(ISBLANK('FY25-26 Work Plan'!$I$28:$I$28),\"\",'FY25-26 Work Plan'!$I$28:$I$28)","v":""},{"$f":"IF(ISBLANK('FY25-26 Work Plan'!$E$29:$E$29),\"\",'FY25-26 Work Plan'!$E$29:$E$29)","v":""},{"$f":"IF(ISBLANK('FY25-26 Work Plan'!$I$29:$I$29),\"\",'FY25-26 Work Plan'!$I$29:$I$29)","v":""},{"$f":"IF(ISBLANK('FY25-26 Work Plan'!$B$30:$B$30),\"\",'FY25-26 Work Plan'!$B$30:$B$30)","v":""},{"$f":"IF(ISBLANK('FY25-26 Work Plan'!$E$30:$E$30),\"\",'FY25-26 Work Plan'!$E$30:$E$30)","v":""},{"$f":"IF(ISBLANK('FY25-26 Work Plan'!$I$30:$I$30),\"\",'FY25-26 Work Plan'!$I$30:$I$30)","v":""},{"$f":"IF(ISBLANK('FY25-26 Work Plan'!$B$31:$B$31),\"\",'FY25-26 Work Plan'!$B$31:$B$31)","v":""},{"$f":"IF(ISBLANK('FY25-26 Work Plan'!$E$31:$E$31),\"\",'FY25-26 Work Plan'!$E$31:$E$31)","v":""},{"$f":"IF(ISBLANK('FY25-26 Work Plan'!$I$31:$I$31),\"\",'FY25-26 Work Plan'!$I$31:$I$31)","v":""},{"$f":"IF(ISBLANK('FY25-26 Work Plan'!$B$32:$B$32),\"\",'FY25-26 Work Plan'!$B$32:$B$32)","v":""},{"$f":"IF(ISBLANK('FY25-26 Work Plan'!$E$32:$E$32),\"\",'FY25-26 Work Plan'!$E$32:$E$32)","v":""},{"$f":"IF(ISBLANK('FY25-26 Work Plan'!$I$32:$I$32),\"\",'FY25-26 Work Plan'!$I$32:$I$32)","v":""},{"$f":"IF(ISBLANK('FY25-26 Work Plan'!#REF!),\"\",'FY25-26 Work Plan'!#REF!)","v":{"$error":"#REF!"}},{"$f":"IF(ISBLANK('FY25-26 Work Plan'!#REF!),\"\",'FY25-26 Work Plan'!#REF!)","v":{"$error":"#REF!"}},{"$f":"IF(ISBLANK('FY25-26 Work Plan'!#REF!),\"\",'FY25-26 Work Plan'!#REF!)","v":{"$error":"#REF!"}},{"$f":"IF(ISBLANK('FY25-26 Work Plan'!#REF!),\"\",'FY25-26 Work Plan'!#REF!)","v":{"$error":"#REF!"}},{"$f":"IF(ISBLANK('FY25-26 Work Plan'!#REF!),\"\",'FY25-26 Work Plan'!#REF!)","v":{"$error":"#REF!"}},{"$f":"IF(ISBLANK('FY25-26 Work Plan'!#REF!),\"\",'FY25-26 Work Plan'!#REF!)","v":{"$error":"#REF!"}},{"$f":"IF(ISBLANK('FY25-26 Work Plan'!#REF!),\"\",'FY25-26 Work Plan'!#REF!)","v":{"$error":"#REF!"}},{"$f":"IF(ISBLANK('FY25-26 Work Plan'!#REF!),\"\",'FY25-26 Work Plan'!#REF!)","v":{"$error":"#REF!"}},{"$f":"IF(ISBLANK('FY25-26 Work Plan'!#REF!),\"\",'FY25-26 Work Plan'!#REF!)","v":{"$error":"#REF!"}}]
[{"$f":"IF(ISBLANK('FY25-26 Work Plan'!$E$2:$E$2),\"\",'FY25-26 Work Plan'!$E$2:$E$2)","v":"Asian American Drug Abuse Programs, Inc. (AADAP)"},{"$f":"IF(ISBLANK('FY25-26 Work Plan'!$L$2:$L$2),\"\",'FY25-26 Work Plan'!$L$2:$L$2)","v":"Prevention Education Program (PEP)"},{"$f":"IF(ISBLANK('FY25-26 Work Plan'!$L$3:$L$3),\"\",'FY25-26 Work Plan'!$L$3:$L$3)","v":""},{"$f":"IF(ISBLANK('FY25-26 Work Plan'!$E$3:$E$3),\"\",'FY25-26 Work Plan'!$E$3:$E$3)","v":"PH-005150 "},{"$f":"IF(ISBLANK('FY25-26 Work Plan'!$E$4:$E$4),\"\",TEXT('FY25-26 Work Plan'!$E$4:$E$4,\"000000\"))","v":"000001"},{"$f":"IF(ISBLANK('FY25-26 Work Plan'!$L$4:$L$4),\"\",'FY25-26 Work Plan'!$L$4:$L$4)","v":""},{"$f":"IF(ISBLANK('FY25-26 Work Plan'!$E$5:$E$5),\"\",'FY25-26 Work Plan'!$E$5:$E$5)","v":"2 - San Fernando Valley"},{"$f":"IF(ISBLANK('FY25-26 Work Plan'!$L$5:$L$5),\"\",'FY25-26 Work Plan'!$L$5:$L$5)","v":""},{"$f":"IF(ISBLANK('FY25-26 Work Plan'!$E$6:$E$6),\"\",'FY25-26 Work Plan'!$E$6:$E$6)","v":"Agoura Hills, Agua Dulce*"},{"$f":"IF(ISBLANK('FY25-26 Work Plan'!$F$7:$F$7),\"\",'FY25-26 Work Plan'!$F$7:$F$7)","v":""},{"$f":"IF(ISBLANK('FY25-26 Work Plan'!$F$8:$F$8),\"\",'FY25-26 Work Plan'!$F$8:$F$8)","v":""},{"$f":"IF(ISBLANK('FY25-26 Work Plan'!$E$9:$E$9),\"\",'FY25-26 Work Plan'!$E$9:$E$9)","v":"123 E Main St., Suite 100 \nAnytown, CA 90000"},{"$f":"IF(ISBLANK('FY25-26 Work Plan'!$L$9:$L$9),\"\",TEXT('FY25-26 Work Plan'!$L$9:$L$9,\"###-###-####\"))","v":"999-999-9999"},{"$f":"IF(ISBLANK('FY25-26 Work Plan'!$L$10:$L$10),\"\",'FY25-26 Work Plan'!$L$10:$L$10)","v":"www.abc1.org"},{"$f":"IF(ISBLANK('FY25-26 Work Plan'!$E$11:$E$11),\"\",'FY25-26 Work Plan'!$E$11:$E$11)","v":"123 E Main St., Suite 100 \nAnytown, CA 90000"},{"$f":"IF(ISBLANK('FY25-26 Work Plan'!$L$11:$L$11),\"\",TEXT('FY25-26 Work Plan'!$L$11:$L$11,\"###-###-####\"))","v":"999-999-9999"},{"$f":"IF(ISBLANK('FY25-26 Work Plan'!$L$12:$L$12),\"\",'FY25-26 Work Plan'!$L$12:$L$12)","v":"www.abc2.org"},{"$f":"IF(ISBLANK('FY25-26 Work Plan'!$E$15:$E$15),\"\",'FY25-26 Work Plan'!$E$15:$E$15)","v":"John/Jane Doe"},{"$f":"IF(ISBLANK('FY25-26 Work Plan'!$I$15:$I$15),\"\",TEXT('FY25-26 Work Plan'!$I$15:$I$15,\"###-###-####\"))","v":"213-555-1212"},{"$f":"IF(ISBLANK('FY25-26 Work Plan'!$L$15:$L$15),\"\",'FY25-26 Work Plan'!$L$15:$L$15)","v":"janedoe@preventionusa.com"},{"$f":"IF(ISBLANK('FY25-26 Work Plan'!$E$16:$E$16),\"\",'FY25-26 Work Plan'!$E$16:$E$16)","v":"John/Jane Doe"},{"$f":"IF(ISBLANK('FY25-26 Work Plan'!$I$16:$I$16),\"\",TEXT('FY25-26 Work Plan'!$I$16:$I$16,\"###-###-####\"))","v":"213-555-1212"},{"$f":"IF(ISBLANK('FY25-26 Work Plan'!$L$16:$L$16),\"\",'FY25-26 Work Plan'!$L$16:$L$16)","v":"janedoe@preventionusa.com"},{"$f":"IF(ISBLANK('FY25-26 Work Plan'!$E$17:$E$17),\"\",'FY25-26 Work Plan'!$E$17:$E$17)","v":"John/Jane Doe"},{"$f":"IF(ISBLANK('FY25-26 Work Plan'!$I$17:$I$17),\"\",TEXT('FY25-26 Work Plan'!$I$17:$I$17,\"###-###-####\"))","v":"213-555-1212"},{"$f":"IF(ISBLANK('FY25-26 Work Plan'!$L$17:$L$17),\"\",'FY25-26 Work Plan'!$L$17:$L$17)","v":"j.doe@preventionusa.com"},{"$f":"IF(ISBLANK('FY25-26 Work Plan'!$E$18:$E$18),\"\",'FY25-26 Work Plan'!$E$18:$E$18)","v":"John/Jane Doe"},{"$f":"IF(ISBLANK('FY25-26 Work Plan'!$I$18:$I$18),\"\",TEXT('FY25-26 Work Plan'!$I$18:$I$18,\"###-###-####\"))","v":"213-555-1213"},{"$f":"IF(ISBLANK('FY25-26 Work Plan'!$L$18:$L$18),\"\",'FY25-26 Work Plan'!$L$18:$L$18)","v":"j.doe@preventionusa.com"},{"$f":"IF(ISBLANK('FY25-26 Work Plan'!$E$19:$E$19),\"\",'FY25-26 Work Plan'!$E$19:$E$19)","v":"John/Jane Doe"},{"$f":"IF(ISBLANK('FY25-26 Work Plan'!$I$19:$I$19),\"\",TEXT('FY25-26 Work Plan'!$I$19:$I$19,\"###-###-####\"))","v":"213-555-1213"},{"$f":"IF(ISBLANK('FY25-26 Work Plan'!$L$19:$L$19),\"\",'FY25-26 Work Plan'!$L$19:$L$19)","v":"j.doe@preventionusa.com"},{"$f":"IF(ISBLANK('FY25-26 Work Plan'!$E$23:$E$23),\"\",'FY25-26 Work Plan'!$E$23:$E$23)","v":""},{"$f":"IF(ISBLANK('FY25-26 Work Plan'!$I$23:$I$23),\"\",'FY25-26 Work Plan'!$I$23:$I$23)","v":""},{"$f":"IF(ISBLANK('FY25-26 Work Plan'!$E$24:$E$24),\"\",'FY25-26 Work Plan'!$E$24:$E$24)","v":""},{"$f":"IF(ISBLANK('FY25-26 Work Plan'!$I$24:$I$24),\"\",'FY25-26 Work Plan'!$I$24:$I$24)","v":""},{"$f":"IF(ISBLANK('FY25-26 Work Plan'!$E$25:$E$25),\"\",'FY25-26 Work Plan'!$E$25:$E$25)","v":""},{"$f":"IF(ISBLANK('FY25-26 Work Plan'!$I$25:$I$25),\"\",'FY25-26 Work Plan'!$I$25:$I$25)","v":""},{"$f":"IF(ISBLANK('FY25-26 Work Plan'!$E$26:$E$26),\"\",'FY25-26 Work Plan'!$E$26:$E$26)","v":""},{"$f":"IF(ISBLANK('FY25-26 Work Plan'!$I$26:$I$26),\"\",'FY25-26 Work Plan'!$I$26:$I$26)","v":""},{"$f":"IF(ISBLANK('FY25-26 Work Plan'!$E$27:$E$27),\"\",'FY25-26 Work Plan'!$E$27:$E$27)","v":""},{"$f":"IF(ISBLANK('FY25-26 Work Plan'!$I$27:$I$27),\"\",'FY25-26 Work Plan'!$I$27:$I$27)","v":""},{"$f":"IF(ISBLANK('FY25-26 Work Plan'!$E$28:$E$28),\"\",'FY25-26 Work Plan'!$E$28:$E$28)","v":""},{"$f":"IF(ISBLANK('FY25-26 Work Plan'!$I$28:$I$28),\"\",'FY25-26 Work Plan'!$I$28:$I$28)","v":""},{"$f":"IF(ISBLANK('FY25-26 Work Plan'!$E$29:$E$29),\"\",'FY25-26 Work Plan'!$E$29:$E$29)","v":""},{"$f":"IF(ISBLANK('FY25-26 Work Plan'!$I$29:$I$29),\"\",'FY25-26 Work Plan'!$I$29:$I$29)","v":""},{"$f":"IF(ISBLANK('FY25-26 Work Plan'!$B$30:$B$30),\"\",'FY25-26 Work Plan'!$B$30:$B$30)","v":""},{"$f":"IF(ISBLANK('FY25-26 Work Plan'!$E$30:$E$30),\"\",'FY25-26 Work Plan'!$E$30:$E$30)","v":""},{"$f":"IF(ISBLANK('FY25-26 Work Plan'!$I$30:$I$30),\"\",'FY25-26 Work Plan'!$I$30:$I$30)","v":""},{"$f":"IF(ISBLANK('FY25-26 Work Plan'!$B$31:$B$31),\"\",'FY25-26 Work Plan'!$B$31:$B$31)","v":""},{"$f":"IF(ISBLANK('FY25-26 Work Plan'!$E$31:$E$31),\"\",'FY25-26 Work Plan'!$E$31:$E$31)","v":""},{"$f":"IF(ISBLANK('FY25-26 Work Plan'!$I$31:$I$31),\"\",'FY25-26 Work Plan'!$I$31:$I$31)","v":""},{"$f":"IF(ISBLANK('FY25-26 Work Plan'!$B$32:$B$32),\"\",'FY25-26 Work Plan'!$B$32:$B$32)","v":""},{"$f":"IF(ISBLANK('FY25-26 Work Plan'!$E$32:$E$32),\"\",'FY25-26 Work Plan'!$E$32:$E$32)","v":""},{"$f":"IF(ISBLANK('FY25-26 Work Plan'!$I$32:$I$32),\"\",'FY25-26 Work Plan'!$I$32:$I$32)","v":""},{"$f":"IF(ISBLANK('FY25-26 Work Plan'!#REF!),\"\",'FY25-26 Work Plan'!#REF!)","v":{"$error":"#REF!"}},{"$f":"IF(ISBLANK('FY25-26 Work Plan'!#REF!),\"\",'FY25-26 Work Plan'!#REF!)","v":{"$error":"#REF!"}},{"$f":"IF(ISBLANK('FY25-26 Work Plan'!#REF!),\"\",'FY25-26 Work Plan'!#REF!)","v":{"$error":"#REF!"}},{"$f":"IF(ISBLANK('FY25-26 Work Plan'!#REF!),\"\",'FY25-26 Work Plan'!#REF!)","v":{"$error":"#REF!"}},{"$f":"IF(ISBLANK('FY25-26 Work Plan'!#REF!),\"\",'FY25-26 Work Plan'!#REF!)","v":{"$error":"#REF!"}},{"$f":"IF(ISBLANK('FY25-26 Work Plan'!#REF!),\"\",'FY25-26 Work Plan'!#REF!)","v":{"$error":"#REF!"}},{"$f":"IF(ISBLANK('FY25-26 Work Plan'!#REF!),\"\",'FY25-26 Work Plan'!#REF!)","v":{"$error":"#REF!"}},{"$f":"IF(ISBLANK('FY25-26 Work Plan'!#REF!),\"\",'FY25-26 Work Plan'!#REF!)","v":{"$error":"#REF!"}},{"$f":"IF(ISBLANK('FY25-26 Work Plan'!#REF!),\"\",'FY25-26 Work Plan'!#REF!)","v":{"$error":"#REF!"}}]
[{"$f":"IF(ISBLANK('FY25-26 Work Plan'!$E$2:$E$2),\"\",'FY25-26 Work Plan'!$E$2:$E$2)","v":"Asian American Drug Abuse Programs, Inc. (AADAP)"},{"$f":"IF(ISBLANK('FY25-26 Work Plan'!$L$2:$L$2),\"\",'FY25-26 Work Plan'!$L$2:$L$2)","v":"Prevention Education Program (PEP)"},{"$f":"IF(ISBLANK('FY25-26 Work Plan'!$L$3:$L$3),\"\",'FY25-26 Work Plan'!$L$3:$L$3)","v":""},{"$f":"IF(ISBLANK('FY25-26 Work Plan'!$E$3:$E$3),\"\",'FY25-26 Work Plan'!$E$3:$E$3)","v":"PH-005150 "},{"$f":"IF(ISBLANK('FY25-26 Work Plan'!$E$4:$E$4),\"\",TEXT('FY25-26 Work Plan'!$E$4:$E$4,\"000000\"))","v":"000001"},{"$f":"IF(ISBLANK('FY25-26 Work Plan'!$L$4:$L$4),\"\",'FY25-26 Work Plan'!$L$4:$L$4)","v":""},{"$f":"IF(ISBLANK('FY25-26 Work Plan'!$E$5:$E$5),\"\",'FY25-26 Work Plan'!$E$5:$E$5)","v":"2 - San Fernando Valley"},{"$f":"IF(ISBLANK('FY25-26 Work Plan'!$L$5:$L$5),\"\",'FY25-26 Work Plan'!$L$5:$L$5)","v":""},{"$f":"IF(ISBLANK('FY25-26 Work Plan'!$E$6:$E$6),\"\",'FY25-26 Work Plan'!$E$6:$E$6)","v":"Agoura Hills, Agua Dulce*"},{"$f":"IF(ISBLANK('FY25-26 Work Plan'!$F$7:$F$7),\"\",'FY25-26 Work Plan'!$F$7:$F$7)","v":""},{"$f":"IF(ISBLANK('FY25-26 Work Plan'!$F$8:$F$8),\"\",'FY25-26 Work Plan'!$F$8:$F$8)","v":""},{"$f":"IF(ISBLANK('FY25-26 Work Plan'!$E$9:$E$9),\"\",'FY25-26 Work Plan'!$E$9:$E$9)","v":"123 E Main St., Suite 100 \nAnytown, CA 90000"},{"$f":"IF(ISBLANK('FY25-26 Work Plan'!$L$9:$L$9),\"\",TEXT('FY25-26 Work Plan'!$L$9:$L$9,\"###-###-####\"))","v":"999-999-9999"},{"$f":"IF(ISBLANK('FY25-26 Work Plan'!$L$10:$L$10),\"\",'FY25-26 Work Plan'!$L$10:$L$10)","v":"www.abc1.org"},{"$f":"IF(ISBLANK('FY25-26 Work Plan'!$E$11:$E$11),\"\",'FY25-26 Work Plan'!$E$11:$E$11)","v":"123 E Main St., Suite 100 \nAnytown, CA 90000"},{"$f":"IF(ISBLANK('FY25-26 Work Plan'!$L$11:$L$11),\"\",TEXT('FY25-26 Work Plan'!$L$11:$L$11,\"###-###-####\"))","v":"999-999-9999"},{"$f":"IF(ISBLANK('FY25-26 Work Plan'!$L$12:$L$12),\"\",'FY25-26 Work Plan'!$L$12:$L$12)","v":"www.abc2.org"},{"$f":"IF(ISBLANK('FY25-26 Work Plan'!$E$15:$E$15),\"\",'FY25-26 Work Plan'!$E$15:$E$15)","v":"John/Jane Doe"},{"$f":"IF(ISBLANK('FY25-26 Work Plan'!$I$15:$I$15),\"\",TEXT('FY25-26 Work Plan'!$I$15:$I$15,\"###-###-####\"))","v":"213-555-1212"},{"$f":"IF(ISBLANK('FY25-26 Work Plan'!$L$15:$L$15),\"\",'FY25-26 Work Plan'!$L$15:$L$15)","v":"janedoe@preventionusa.com"},{"$f":"IF(ISBLANK('FY25-26 Work Plan'!$E$16:$E$16),\"\",'FY25-26 Work Plan'!$E$16:$E$16)","v":"John/Jane Doe"},{"$f":"IF(ISBLANK('FY25-26 Work Plan'!$I$16:$I$16),\"\",TEXT('FY25-26 Work Plan'!$I$16:$I$16,\"###-###-####\"))","v":"213-555-1212"},{"$f":"IF(ISBLANK('FY25-26 Work Plan'!$L$16:$L$16),\"\",'FY25-26 Work Plan'!$L$16:$L$16)","v":"janedoe@preventionusa.com"},{"$f":"IF(ISBLANK('FY25-26 Work Plan'!$E$17:$E$17),\"\",'FY25-26 Work Plan'!$E$17:$E$17)","v":"John/Jane Doe"},{"$f":"IF(ISBLANK('FY25-26 Work Plan'!$I$17:$I$17),\"\",TEXT('FY25-26 Work Plan'!$I$17:$I$17,\"###-###-####\"))","v":"213-555-1212"},{"$f":"IF(ISBLANK('FY25-26 Work Plan'!$L$17:$L$17),\"\",'FY25-26 Work Plan'!$L$17:$L$17)","v":"j.doe@preventionusa.com"},{"$f":"IF(ISBLANK('FY25-26 Work Plan'!$E$18:$E$18),\"\",'FY25-26 Work Plan'!$E$18:$E$18)","v":"John/Jane Doe"},{"$f":"IF(ISBLANK('FY25-26 Work Plan'!$I$18:$I$18),\"\",TEXT('FY25-26 Work Plan'!$I$18:$I$18,\"###-###-####\"))","v":"213-555-1213"},{"$f":"IF(ISBLANK('FY25-26 Work Plan'!$L$18:$L$18),\"\",'FY25-26 Work Plan'!$L$18:$L$18)","v":"j.doe@preventionusa.com"},{"$f":"IF(ISBLANK('FY25-26 Work Plan'!$E$19:$E$19),\"\",'FY25-26 Work Plan'!$E$19:$E$19)","v":"John/Jane Doe"},{"$f":"IF(ISBLANK('FY25-26 Work Plan'!$I$19:$I$19),\"\",TEXT('FY25-26 Work Plan'!$I$19:$I$19,\"###-###-####\"))","v":"213-555-1213"},{"$f":"IF(ISBLANK('FY25-26 Work Plan'!$L$19:$L$19),\"\",'FY25-26 Work Plan'!$L$19:$L$19)","v":"j.doe@preventionusa.com"},{"$f":"IF(ISBLANK('FY25-26 Work Plan'!$E$23:$E$23),\"\",'FY25-26 Work Plan'!$E$23:$E$23)","v":""},{"$f":"IF(ISBLANK('FY25-26 Work Plan'!$I$23:$I$23),\"\",'FY25-26 Work Plan'!$I$23:$I$23)","v":""},{"$f":"IF(ISBLANK('FY25-26 Work Plan'!$E$24:$E$24),\"\",'FY25-26 Work Plan'!$E$24:$E$24)","v":""},{"$f":"IF(ISBLANK('FY25-26 Work Plan'!$I$24:$I$24),\"\",'FY25-26 Work Plan'!$I$24:$I$24)","v":""},{"$f":"IF(ISBLANK('FY25-26 Work Plan'!$E$25:$E$25),\"\",'FY25-26 Work Plan'!$E$25:$E$25)","v":""},{"$f":"IF(ISBLANK('FY25-26 Work Plan'!$I$25:$I$25),\"\",'FY25-26 Work Plan'!$I$25:$I$25)","v":""},{"$f":"IF(ISBLANK('FY25-26 Work Plan'!$E$26:$E$26),\"\",'FY25-26 Work Plan'!$E$26:$E$26)","v":""},{"$f":"IF(ISBLANK('FY25-26 Work Plan'!$I$26:$I$26),\"\",'FY25-26 Work Plan'!$I$26:$I$26)","v":""},{"$f":"IF(ISBLANK('FY25-26 Work Plan'!$E$27:$E$27),\"\",'FY25-26 Work Plan'!$E$27:$E$27)","v":""},{"$f":"IF(ISBLANK('FY25-26 Work Plan'!$I$27:$I$27),\"\",'FY25-26 Work Plan'!$I$27:$I$27)","v":""},{"$f":"IF(ISBLANK('FY25-26 Work Plan'!$E$28:$E$28),\"\",'FY25-26 Work Plan'!$E$28:$E$28)","v":""},{"$f":"IF(ISBLANK('FY25-26 Work Plan'!$I$28:$I$28),\"\",'FY25-26 Work Plan'!$I$28:$I$28)","v":""},{"$f":"IF(ISBLANK('FY25-26 Work Plan'!$E$29:$E$29),\"\",'FY25-26 Work Plan'!$E$29:$E$29)","v":""},{"$f":"IF(ISBLANK('FY25-26 Work Plan'!$I$29:$I$29),\"\",'FY25-26 Work Plan'!$I$29:$I$29)","v":""},{"$f":"IF(ISBLANK('FY25-26 Work Plan'!$B$30:$B$30),\"\",'FY25-26 Work Plan'!$B$30:$B$30)","v":""},{"$f":"IF(ISBLANK('FY25-26 Work Plan'!$E$30:$E$30),\"\",'FY25-26 Work Plan'!$E$30:$E$30)","v":""},{"$f":"IF(ISBLANK('FY25-26 Work Plan'!$I$30:$I$30),\"\",'FY25-26 Work Plan'!$I$30:$I$30)","v":""},{"$f":"IF(ISBLANK('FY25-26 Work Plan'!$B$31:$B$31),\"\",'FY25-26 Work Plan'!$B$31:$B$31)","v":""},{"$f":"IF(ISBLANK('FY25-26 Work Plan'!$E$31:$E$31),\"\",'FY25-26 Work Plan'!$E$31:$E$31)","v":""},{"$f":"IF(ISBLANK('FY25-26 Work Plan'!$I$31:$I$31),\"\",'FY25-26 Work Plan'!$I$31:$I$31)","v":""},{"$f":"IF(ISBLANK('FY25-26 Work Plan'!$B$32:$B$32),\"\",'FY25-26 Work Plan'!$B$32:$B$32)","v":""},{"$f":"IF(ISBLANK('FY25-26 Work Plan'!$E$32:$E$32),\"\",'FY25-26 Work Plan'!$E$32:$E$32)","v":""},{"$f":"IF(ISBLANK('FY25-26 Work Plan'!$I$32:$I$32),\"\",'FY25-26 Work Plan'!$I$32:$I$32)","v":""},{"$f":"IF(ISBLANK('FY25-26 Work Plan'!#REF!),\"\",'FY25-26 Work Plan'!#REF!)","v":{"$error":"#REF!"}},{"$f":"IF(ISBLANK('FY25-26 Work Plan'!#REF!),\"\",'FY25-26 Work Plan'!#REF!)","v":{"$error":"#REF!"}},{"$f":"IF(ISBLANK('FY25-26 Work Plan'!#REF!),\"\",'FY25-26 Work Plan'!#REF!)","v":{"$error":"#REF!"}},{"$f":"IF(ISBLANK('FY25-26 Work Plan'!#REF!),\"\",'FY25-26 Work Plan'!#REF!)","v":{"$error":"#REF!"}},{"$f":"IF(ISBLANK('FY25-26 Work Plan'!#REF!),\"\",'FY25-26 Work Plan'!#REF!)","v":{"$error":"#REF!"}},{"$f":"IF(ISBLANK('FY25-26 Work Plan'!#REF!),\"\",'FY25-26 Work Plan'!#REF!)","v":{"$error":"#REF!"}},{"$f":"IF(ISBLANK('FY25-26 Work Plan'!#REF!),\"\",'FY25-26 Work Plan'!#REF!)","v":{"$error":"#REF!"}},{"$f":"IF(ISBLANK('FY25-26 Work Plan'!#REF!),\"\",'FY25-26 Work Plan'!#REF!)","v":{"$error":"#REF!"}},{"$f":"IF(ISBLANK('FY25-26 Work Plan'!#REF!),\"\",'FY25-26 Work Plan'!#REF!)","v":{"$error":"#REF!"}}]
[{"$f":"IF(ISBLANK('FY25-26 Work Plan'!$E$2:$E$2),\"\",'FY25-26 Work Plan'!$E$2:$E$2)","v":"Asian American Drug Abuse Programs, Inc. (AADAP)"},{"$f":"IF(ISBLANK('FY25-26 Work Plan'!$L$2:$L$2),\"\",'FY25-26 Work Plan'!$L$2:$L$2)","v":"Prevention Education Program (PEP)"},{"$f":"IF(ISBLANK('FY25-26 Work Plan'!$L$3:$L$3),\"\",'FY25-26 Work Plan'!$L$3:$L$3)","v":""},{"$f":"IF(ISBLANK('FY25-26 Work Plan'!$E$3:$E$3),\"\",'FY25-26 Work Plan'!$E$3:$E$3)","v":"PH-005150 "},{"$f":"IF(ISBLANK('FY25-26 Work Plan'!$E$4:$E$4),\"\",TEXT('FY25-26 Work Plan'!$E$4:$E$4,\"000000\"))","v":"000001"},{"$f":"IF(ISBLANK('FY25-26 Work Plan'!$L$4:$L$4),\"\",'FY25-26 Work Plan'!$L$4:$L$4)","v":""},{"$f":"IF(ISBLANK('FY25-26 Work Plan'!$E$5:$E$5),\"\",'FY25-26 Work Plan'!$E$5:$E$5)","v":"2 - San Fernando Valley"},{"$f":"IF(ISBLANK('FY25-26 Work Plan'!$L$5:$L$5),\"\",'FY25-26 Work Plan'!$L$5:$L$5)","v":""},{"$f":"IF(ISBLANK('FY25-26 Work Plan'!$E$6:$E$6),\"\",'FY25-26 Work Plan'!$E$6:$E$6)","v":"Agoura Hills, Agua Dulce*"},{"$f":"IF(ISBLANK('FY25-26 Work Plan'!$F$7:$F$7),\"\",'FY25-26 Work Plan'!$F$7:$F$7)","v":""},{"$f":"IF(ISBLANK('FY25-26 Work Plan'!$F$8:$F$8),\"\",'FY25-26 Work Plan'!$F$8:$F$8)","v":""},{"$f":"IF(ISBLANK('FY25-26 Work Plan'!$E$9:$E$9),\"\",'FY25-26 Work Plan'!$E$9:$E$9)","v":"123 E Main St., Suite 100 \nAnytown, CA 90000"},{"$f":"IF(ISBLANK('FY25-26 Work Plan'!$L$9:$L$9),\"\",TEXT('FY25-26 Work Plan'!$L$9:$L$9,\"###-###-####\"))","v":"999-999-9999"},{"$f":"IF(ISBLANK('FY25-26 Work Plan'!$L$10:$L$10),\"\",'FY25-26 Work Plan'!$L$10:$L$10)","v":"www.abc1.org"},{"$f":"IF(ISBLANK('FY25-26 Work Plan'!$E$11:$E$11),\"\",'FY25-26 Work Plan'!$E$11:$E$11)","v":"123 E Main St., Suite 100 \nAnytown, CA 90000"},{"$f":"IF(ISBLANK('FY25-26 Work Plan'!$L$11:$L$11),\"\",TEXT('FY25-26 Work Plan'!$L$11:$L$11,\"###-###-####\"))","v":"999-999-9999"},{"$f":"IF(ISBLANK('FY25-26 Work Plan'!$L$12:$L$12),\"\",'FY25-26 Work Plan'!$L$12:$L$12)","v":"www.abc2.org"},{"$f":"IF(ISBLANK('FY25-26 Work Plan'!$E$15:$E$15),\"\",'FY25-26 Work Plan'!$E$15:$E$15)","v":"John/Jane Doe"},{"$f":"IF(ISBLANK('FY25-26 Work Plan'!$I$15:$I$15),\"\",TEXT('FY25-26 Work Plan'!$I$15:$I$15,\"###-###-####\"))","v":"213-555-1212"},{"$f":"IF(ISBLANK('FY25-26 Work Plan'!$L$15:$L$15),\"\",'FY25-26 Work Plan'!$L$15:$L$15)","v":"janedoe@preventionusa.com"},{"$f":"IF(ISBLANK('FY25-26 Work Plan'!$E$16:$E$16),\"\",'FY25-26 Work Plan'!$E$16:$E$16)","v":"John/Jane Doe"},{"$f":"IF(ISBLANK('FY25-26 Work Plan'!$I$16:$I$16),\"\",TEXT('FY25-26 Work Plan'!$I$16:$I$16,\"###-###-####\"))","v":"213-555-1212"},{"$f":"IF(ISBLANK('FY25-26 Work Plan'!$L$16:$L$16),\"\",'FY25-26 Work Plan'!$L$16:$L$16)","v":"janedoe@preventionusa.com"},{"$f":"IF(ISBLANK('FY25-26 Work Plan'!$E$17:$E$17),\"\",'FY25-26 Work Plan'!$E$17:$E$17)","v":"John/Jane Doe"},{"$f":"IF(ISBLANK('FY25-26 Work Plan'!$I$17:$I$17),\"\",TEXT('FY25-26 Work Plan'!$I$17:$I$17,\"###-###-####\"))","v":"213-555-1212"},{"$f":"IF(ISBLANK('FY25-26 Work Plan'!$L$17:$L$17),\"\",'FY25-26 Work Plan'!$L$17:$L$17)","v":"j.doe@preventionusa.com"},{"$f":"IF(ISBLANK('FY25-26 Work Plan'!$E$18:$E$18),\"\",'FY25-26 Work Plan'!$E$18:$E$18)","v":"John/Jane Doe"},{"$f":"IF(ISBLANK('FY25-26 Work Plan'!$I$18:$I$18),\"\",TEXT('FY25-26 Work Plan'!$I$18:$I$18,\"###-###-####\"))","v":"213-555-1213"},{"$f":"IF(ISBLANK('FY25-26 Work Plan'!$L$18:$L$18),\"\",'FY25-26 Work Plan'!$L$18:$L$18)","v":"j.doe@preventionusa.com"},{"$f":"IF(ISBLANK('FY25-26 Work Plan'!$E$19:$E$19),\"\",'FY25-26 Work Plan'!$E$19:$E$19)","v":"John/Jane Doe"},{"$f":"IF(ISBLANK('FY25-26 Work Plan'!$I$19:$I$19),\"\",TEXT('FY25-26 Work Plan'!$I$19:$I$19,\"###-###-####\"))","v":"213-555-1213"},{"$f":"IF(ISBLANK('FY25-26 Work Plan'!$L$19:$L$19),\"\",'FY25-26 Work Plan'!$L$19:$L$19)","v":"j.doe@preventionusa.com"},{"$f":"IF(ISBLANK('FY25-26 Work Plan'!$E$23:$E$23),\"\",'FY25-26 Work Plan'!$E$23:$E$23)","v":""},{"$f":"IF(ISBLANK('FY25-26 Work Plan'!$I$23:$I$23),\"\",'FY25-26 Work Plan'!$I$23:$I$23)","v":""},{"$f":"IF(ISBLANK('FY25-26 Work Plan'!$E$24:$E$24),\"\",'FY25-26 Work Plan'!$E$24:$E$24)","v":""},{"$f":"IF(ISBLANK('FY25-26 Work Plan'!$I$24:$I$24),\"\",'FY25-26 Work Plan'!$I$24:$I$24)","v":""},{"$f":"IF(ISBLANK('FY25-26 Work Plan'!$E$25:$E$25),\"\",'FY25-26 Work Plan'!$E$25:$E$25)","v":""},{"$f":"IF(ISBLANK('FY25-26 Work Plan'!$I$25:$I$25),\"\",'FY25-26 Work Plan'!$I$25:$I$25)","v":""},{"$f":"IF(ISBLANK('FY25-26 Work Plan'!$E$26:$E$26),\"\",'FY25-26 Work Plan'!$E$26:$E$26)","v":""},{"$f":"IF(ISBLANK('FY25-26 Work Plan'!$I$26:$I$26),\"\",'FY25-26 Work Plan'!$I$26:$I$26)","v":""},{"$f":"IF(ISBLANK('FY25-26 Work Plan'!$E$27:$E$27),\"\",'FY25-26 Work Plan'!$E$27:$E$27)","v":""},{"$f":"IF(ISBLANK('FY25-26 Work Plan'!$I$27:$I$27),\"\",'FY25-26 Work Plan'!$I$27:$I$27)","v":""},{"$f":"IF(ISBLANK('FY25-26 Work Plan'!$E$28:$E$28),\"\",'FY25-26 Work Plan'!$E$28:$E$28)","v":""},{"$f":"IF(ISBLANK('FY25-26 Work Plan'!$I$28:$I$28),\"\",'FY25-26 Work Plan'!$I$28:$I$28)","v":""},{"$f":"IF(ISBLANK('FY25-26 Work Plan'!$E$29:$E$29),\"\",'FY25-26 Work Plan'!$E$29:$E$29)","v":""},{"$f":"IF(ISBLANK('FY25-26 Work Plan'!$I$29:$I$29),\"\",'FY25-26 Work Plan'!$I$29:$I$29)","v":""},{"$f":"IF(ISBLANK('FY25-26 Work Plan'!$B$30:$B$30),\"\",'FY25-26 Work Plan'!$B$30:$B$30)","v":""},{"$f":"IF(ISBLANK('FY25-26 Work Plan'!$E$30:$E$30),\"\",'FY25-26 Work Plan'!$E$30:$E$30)","v":""},{"$f":"IF(ISBLANK('FY25-26 Work Plan'!$I$30:$I$30),\"\",'FY25-26 Work Plan'!$I$30:$I$30)","v":""},{"$f":"IF(ISBLANK('FY25-26 Work Plan'!$B$31:$B$31),\"\",'FY25-26 Work Plan'!$B$31:$B$31)","v":""},{"$f":"IF(ISBLANK('FY25-26 Work Plan'!$E$31:$E$31),\"\",'FY25-26 Work Plan'!$E$31:$E$31)","v":""},{"$f":"IF(ISBLANK('FY25-26 Work Plan'!$I$31:$I$31),\"\",'FY25-26 Work Plan'!$I$31:$I$31)","v":""},{"$f":"IF(ISBLANK('FY25-26 Work Plan'!$B$32:$B$32),\"\",'FY25-26 Work Plan'!$B$32:$B$32)","v":""},{"$f":"IF(ISBLANK('FY25-26 Work Plan'!$E$32:$E$32),\"\",'FY25-26 Work Plan'!$E$32:$E$32)","v":""},{"$f":"IF(ISBLANK('FY25-26 Work Plan'!$I$32:$I$32),\"\",'FY25-26 Work Plan'!$I$32:$I$32)","v":""},{"$f":"IF(ISBLANK('FY25-26 Work Plan'!#REF!),\"\",'FY25-26 Work Plan'!#REF!)","v":{"$error":"#REF!"}},{"$f":"IF(ISBLANK('FY25-26 Work Plan'!#REF!),\"\",'FY25-26 Work Plan'!#REF!)","v":{"$error":"#REF!"}},{"$f":"IF(ISBLANK('FY25-26 Work Plan'!#REF!),\"\",'FY25-26 Work Plan'!#REF!)","v":{"$error":"#REF!"}},{"$f":"IF(ISBLANK('FY25-26 Work Plan'!#REF!),\"\",'FY25-26 Work Plan'!#REF!)","v":{"$error":"#REF!"}},{"$f":"IF(ISBLANK('FY25-26 Work Plan'!#REF!),\"\",'FY25-26 Work Plan'!#REF!)","v":{"$error":"#REF!"}},{"$f":"IF(ISBLANK('FY25-26 Work Plan'!#REF!),\"\",'FY25-26 Work Plan'!#REF!)","v":{"$error":"#REF!"}},{"$f":"IF(ISBLANK('FY25-26 Work Plan'!#REF!),\"\",'FY25-26 Work Plan'!#REF!)","v":{"$error":"#REF!"}},{"$f":"IF(ISBLANK('FY25-26 Work Plan'!#REF!),\"\",'FY25-26 Work Plan'!#REF!)","v":{"$error":"#REF!"}},{"$f":"IF(ISBLANK('FY25-26 Work Plan'!#REF!),\"\",'FY25-26 Work Plan'!#REF!)","v":{"$error":"#REF!"}}]
[{"$f":"IF(ISBLANK('FY25-26 Work Plan'!$E$2:$E$2),\"\",'FY25-26 Work Plan'!$E$2:$E$2)","v":"Asian American Drug Abuse Programs, Inc. (AADAP)"},{"$f":"IF(ISBLANK('FY25-26 Work Plan'!$L$2:$L$2),\"\",'FY25-26 Work Plan'!$L$2:$L$2)","v":"Prevention Education Program (PEP)"},{"$f":"IF(ISBLANK('FY25-26 Work Plan'!$L$3:$L$3),\"\",'FY25-26 Work Plan'!$L$3:$L$3)","v":""},{"$f":"IF(ISBLANK('FY25-26 Work Plan'!$E$3:$E$3),\"\",'FY25-26 Work Plan'!$E$3:$E$3)","v":"PH-005150 "},{"$f":"IF(ISBLANK('FY25-26 Work Plan'!$E$4:$E$4),\"\",TEXT('FY25-26 Work Plan'!$E$4:$E$4,\"000000\"))","v":"000001"},{"$f":"IF(ISBLANK('FY25-26 Work Plan'!$L$4:$L$4),\"\",'FY25-26 Work Plan'!$L$4:$L$4)","v":""},{"$f":"IF(ISBLANK('FY25-26 Work Plan'!$E$5:$E$5),\"\",'FY25-26 Work Plan'!$E$5:$E$5)","v":"2 - San Fernando Valley"},{"$f":"IF(ISBLANK('FY25-26 Work Plan'!$L$5:$L$5),\"\",'FY25-26 Work Plan'!$L$5:$L$5)","v":""},{"$f":"IF(ISBLANK('FY25-26 Work Plan'!$E$6:$E$6),\"\",'FY25-26 Work Plan'!$E$6:$E$6)","v":"Agoura Hills, Agua Dulce*"},{"$f":"IF(ISBLANK('FY25-26 Work Plan'!$F$7:$F$7),\"\",'FY25-26 Work Plan'!$F$7:$F$7)","v":""},{"$f":"IF(ISBLANK('FY25-26 Work Plan'!$F$8:$F$8),\"\",'FY25-26 Work Plan'!$F$8:$F$8)","v":""},{"$f":"IF(ISBLANK('FY25-26 Work Plan'!$E$9:$E$9),\"\",'FY25-26 Work Plan'!$E$9:$E$9)","v":"123 E Main St., Suite 100 \nAnytown, CA 90000"},{"$f":"IF(ISBLANK('FY25-26 Work Plan'!$L$9:$L$9),\"\",TEXT('FY25-26 Work Plan'!$L$9:$L$9,\"###-###-####\"))","v":"999-999-9999"},{"$f":"IF(ISBLANK('FY25-26 Work Plan'!$L$10:$L$10),\"\",'FY25-26 Work Plan'!$L$10:$L$10)","v":"www.abc1.org"},{"$f":"IF(ISBLANK('FY25-26 Work Plan'!$E$11:$E$11),\"\",'FY25-26 Work Plan'!$E$11:$E$11)","v":"123 E Main St., Suite 100 \nAnytown, CA 90000"},{"$f":"IF(ISBLANK('FY25-26 Work Plan'!$L$11:$L$11),\"\",TEXT('FY25-26 Work Plan'!$L$11:$L$11,\"###-###-####\"))","v":"999-999-9999"},{"$f":"IF(ISBLANK('FY25-26 Work Plan'!$L$12:$L$12),\"\",'FY25-26 Work Plan'!$L$12:$L$12)","v":"www.abc2.org"},{"$f":"IF(ISBLANK('FY25-26 Work Plan'!$E$15:$E$15),\"\",'FY25-26 Work Plan'!$E$15:$E$15)","v":"John/Jane Doe"},{"$f":"IF(ISBLANK('FY25-26 Work Plan'!$I$15:$I$15),\"\",TEXT('FY25-26 Work Plan'!$I$15:$I$15,\"###-###-####\"))","v":"213-555-1212"},{"$f":"IF(ISBLANK('FY25-26 Work Plan'!$L$15:$L$15),\"\",'FY25-26 Work Plan'!$L$15:$L$15)","v":"janedoe@preventionusa.com"},{"$f":"IF(ISBLANK('FY25-26 Work Plan'!$E$16:$E$16),\"\",'FY25-26 Work Plan'!$E$16:$E$16)","v":"John/Jane Doe"},{"$f":"IF(ISBLANK('FY25-26 Work Plan'!$I$16:$I$16),\"\",TEXT('FY25-26 Work Plan'!$I$16:$I$16,\"###-###-####\"))","v":"213-555-1212"},{"$f":"IF(ISBLANK('FY25-26 Work Plan'!$L$16:$L$16),\"\",'FY25-26 Work Plan'!$L$16:$L$16)","v":"janedoe@preventionusa.com"},{"$f":"IF(ISBLANK('FY25-26 Work Plan'!$E$17:$E$17),\"\",'FY25-26 Work Plan'!$E$17:$E$17)","v":"John/Jane Doe"},{"$f":"IF(ISBLANK('FY25-26 Work Plan'!$I$17:$I$17),\"\",TEXT('FY25-26 Work Plan'!$I$17:$I$17,\"###-###-####\"))","v":"213-555-1212"},{"$f":"IF(ISBLANK('FY25-26 Work Plan'!$L$17:$L$17),\"\",'FY25-26 Work Plan'!$L$17:$L$17)","v":"j.doe@preventionusa.com"},{"$f":"IF(ISBLANK('FY25-26 Work Plan'!$E$18:$E$18),\"\",'FY25-26 Work Plan'!$E$18:$E$18)","v":"John/Jane Doe"},{"$f":"IF(ISBLANK('FY25-26 Work Plan'!$I$18:$I$18),\"\",TEXT('FY25-26 Work Plan'!$I$18:$I$18,\"###-###-####\"))","v":"213-555-1213"},{"$f":"IF(ISBLANK('FY25-26 Work Plan'!$L$18:$L$18),\"\",'FY25-26 Work Plan'!$L$18:$L$18)","v":"j.doe@preventionusa.com"},{"$f":"IF(ISBLANK('FY25-26 Work Plan'!$E$19:$E$19),\"\",'FY25-26 Work Plan'!$E$19:$E$19)","v":"John/Jane Doe"},{"$f":"IF(ISBLANK('FY25-26 Work Plan'!$I$19:$I$19),\"\",TEXT('FY25-26 Work Plan'!$I$19:$I$19,\"###-###-####\"))","v":"213-555-1213"},{"$f":"IF(ISBLANK('FY25-26 Work Plan'!$L$19:$L$19),\"\",'FY25-26 Work Plan'!$L$19:$L$19)","v":"j.doe@preventionusa.com"},{"$f":"IF(ISBLANK('FY25-26 Work Plan'!$E$23:$E$23),\"\",'FY25-26 Work Plan'!$E$23:$E$23)","v":""},{"$f":"IF(ISBLANK('FY25-26 Work Plan'!$I$23:$I$23),\"\",'FY25-26 Work Plan'!$I$23:$I$23)","v":""},{"$f":"IF(ISBLANK('FY25-26 Work Plan'!$E$24:$E$24),\"\",'FY25-26 Work Plan'!$E$24:$E$24)","v":""},{"$f":"IF(ISBLANK('FY25-26 Work Plan'!$I$24:$I$24),\"\",'FY25-26 Work Plan'!$I$24:$I$24)","v":""},{"$f":"IF(ISBLANK('FY25-26 Work Plan'!$E$25:$E$25),\"\",'FY25-26 Work Plan'!$E$25:$E$25)","v":""},{"$f":"IF(ISBLANK('FY25-26 Work Plan'!$I$25:$I$25),\"\",'FY25-26 Work Plan'!$I$25:$I$25)","v":""},{"$f":"IF(ISBLANK('FY25-26 Work Plan'!$E$26:$E$26),\"\",'FY25-26 Work Plan'!$E$26:$E$26)","v":""},{"$f":"IF(ISBLANK('FY25-26 Work Plan'!$I$26:$I$26),\"\",'FY25-26 Work Plan'!$I$26:$I$26)","v":""},{"$f":"IF(ISBLANK('FY25-26 Work Plan'!$E$27:$E$27),\"\",'FY25-26 Work Plan'!$E$27:$E$27)","v":""},{"$f":"IF(ISBLANK('FY25-26 Work Plan'!$I$27:$I$27),\"\",'FY25-26 Work Plan'!$I$27:$I$27)","v":""},{"$f":"IF(ISBLANK('FY25-26 Work Plan'!$E$28:$E$28),\"\",'FY25-26 Work Plan'!$E$28:$E$28)","v":""},{"$f":"IF(ISBLANK('FY25-26 Work Plan'!$I$28:$I$28),\"\",'FY25-26 Work Plan'!$I$28:$I$28)","v":""},{"$f":"IF(ISBLANK('FY25-26 Work Plan'!$E$29:$E$29),\"\",'FY25-26 Work Plan'!$E$29:$E$29)","v":""},{"$f":"IF(ISBLANK('FY25-26 Work Plan'!$I$29:$I$29),\"\",'FY25-26 Work Plan'!$I$29:$I$29)","v":""},{"$f":"IF(ISBLANK('FY25-26 Work Plan'!$B$30:$B$30),\"\",'FY25-26 Work Plan'!$B$30:$B$30)","v":""},{"$f":"IF(ISBLANK('FY25-26 Work Plan'!$E$30:$E$30),\"\",'FY25-26 Work Plan'!$E$30:$E$30)","v":""},{"$f":"IF(ISBLANK('FY25-26 Work Plan'!$I$30:$I$30),\"\",'FY25-26 Work Plan'!$I$30:$I$30)","v":""},{"$f":"IF(ISBLANK('FY25-26 Work Plan'!$B$31:$B$31),\"\",'FY25-26 Work Plan'!$B$31:$B$31)","v":""},{"$f":"IF(ISBLANK('FY25-26 Work Plan'!$E$31:$E$31),\"\",'FY25-26 Work Plan'!$E$31:$E$31)","v":""},{"$f":"IF(ISBLANK('FY25-26 Work Plan'!$I$31:$I$31),\"\",'FY25-26 Work Plan'!$I$31:$I$31)","v":""},{"$f":"IF(ISBLANK('FY25-26 Work Plan'!$B$32:$B$32),\"\",'FY25-26 Work Plan'!$B$32:$B$32)","v":""},{"$f":"IF(ISBLANK('FY25-26 Work Plan'!$E$32:$E$32),\"\",'FY25-26 Work Plan'!$E$32:$E$32)","v":""},{"$f":"IF(ISBLANK('FY25-26 Work Plan'!$I$32:$I$32),\"\",'FY25-26 Work Plan'!$I$32:$I$32)","v":""},{"$f":"IF(ISBLANK('FY25-26 Work Plan'!#REF!),\"\",'FY25-26 Work Plan'!#REF!)","v":{"$error":"#REF!"}},{"$f":"IF(ISBLANK('FY25-26 Work Plan'!#REF!),\"\",'FY25-26 Work Plan'!#REF!)","v":{"$error":"#REF!"}},{"$f":"IF(ISBLANK('FY25-26 Work Plan'!#REF!),\"\",'FY25-26 Work Plan'!#REF!)","v":{"$error":"#REF!"}},{"$f":"IF(ISBLANK('FY25-26 Work Plan'!#REF!),\"\",'FY25-26 Work Plan'!#REF!)","v":{"$error":"#REF!"}},{"$f":"IF(ISBLANK('FY25-26 Work Plan'!#REF!),\"\",'FY25-26 Work Plan'!#REF!)","v":{"$error":"#REF!"}},{"$f":"IF(ISBLANK('FY25-26 Work Plan'!#REF!),\"\",'FY25-26 Work Plan'!#REF!)","v":{"$error":"#REF!"}},{"$f":"IF(ISBLANK('FY25-26 Work Plan'!#REF!),\"\",'FY25-26 Work Plan'!#REF!)","v":{"$error":"#REF!"}},{"$f":"IF(ISBLANK('FY25-26 Work Plan'!#REF!),\"\",'FY25-26 Work Plan'!#REF!)","v":{"$error":"#REF!"}},{"$f":"IF(ISBLANK('FY25-26 Work Plan'!#REF!),\"\",'FY25-26 Work Plan'!#REF!)","v":{"$error":"#REF!"}}]
[{"$f":"IF(ISBLANK('FY25-26 Work Plan'!$E$2:$E$2),\"\",'FY25-26 Work Plan'!$E$2:$E$2)","v":"Asian American Drug Abuse Programs, Inc. (AADAP)"},{"$f":"IF(ISBLANK('FY25-26 Work Plan'!$L$2:$L$2),\"\",'FY25-26 Work Plan'!$L$2:$L$2)","v":"Prevention Education Program (PEP)"},{"$f":"IF(ISBLANK('FY25-26 Work Plan'!$L$3:$L$3),\"\",'FY25-26 Work Plan'!$L$3:$L$3)","v":""},{"$f":"IF(ISBLANK('FY25-26 Work Plan'!$E$3:$E$3),\"\",'FY25-26 Work Plan'!$E$3:$E$3)","v":"PH-005150 "},{"$f":"IF(ISBLANK('FY25-26 Work Plan'!$E$4:$E$4),\"\",TEXT('FY25-26 Work Plan'!$E$4:$E$4,\"000000\"))","v":"000001"},{"$f":"IF(ISBLANK('FY25-26 Work Plan'!$L$4:$L$4),\"\",'FY25-26 Work Plan'!$L$4:$L$4)","v":""},{"$f":"IF(ISBLANK('FY25-26 Work Plan'!$E$5:$E$5),\"\",'FY25-26 Work Plan'!$E$5:$E$5)","v":"2 - San Fernando Valley"},{"$f":"IF(ISBLANK('FY25-26 Work Plan'!$L$5:$L$5),\"\",'FY25-26 Work Plan'!$L$5:$L$5)","v":""},{"$f":"IF(ISBLANK('FY25-26 Work Plan'!$E$6:$E$6),\"\",'FY25-26 Work Plan'!$E$6:$E$6)","v":"Agoura Hills, Agua Dulce*"},{"$f":"IF(ISBLANK('FY25-26 Work Plan'!$F$7:$F$7),\"\",'FY25-26 Work Plan'!$F$7:$F$7)","v":""},{"$f":"IF(ISBLANK('FY25-26 Work Plan'!$F$8:$F$8),\"\",'FY25-26 Work Plan'!$F$8:$F$8)","v":""},{"$f":"IF(ISBLANK('FY25-26 Work Plan'!$E$9:$E$9),\"\",'FY25-26 Work Plan'!$E$9:$E$9)","v":"123 E Main St., Suite 100 \nAnytown, CA 90000"},{"$f":"IF(ISBLANK('FY25-26 Work Plan'!$L$9:$L$9),\"\",TEXT('FY25-26 Work Plan'!$L$9:$L$9,\"###-###-####\"))","v":"999-999-9999"},{"$f":"IF(ISBLANK('FY25-26 Work Plan'!$L$10:$L$10),\"\",'FY25-26 Work Plan'!$L$10:$L$10)","v":"www.abc1.org"},{"$f":"IF(ISBLANK('FY25-26 Work Plan'!$E$11:$E$11),\"\",'FY25-26 Work Plan'!$E$11:$E$11)","v":"123 E Main St., Suite 100 \nAnytown, CA 90000"},{"$f":"IF(ISBLANK('FY25-26 Work Plan'!$L$11:$L$11),\"\",TEXT('FY25-26 Work Plan'!$L$11:$L$11,\"###-###-####\"))","v":"999-999-9999"},{"$f":"IF(ISBLANK('FY25-26 Work Plan'!$L$12:$L$12),\"\",'FY25-26 Work Plan'!$L$12:$L$12)","v":"www.abc2.org"},{"$f":"IF(ISBLANK('FY25-26 Work Plan'!$E$15:$E$15),\"\",'FY25-26 Work Plan'!$E$15:$E$15)","v":"John/Jane Doe"},{"$f":"IF(ISBLANK('FY25-26 Work Plan'!$I$15:$I$15),\"\",TEXT('FY25-26 Work Plan'!$I$15:$I$15,\"###-###-####\"))","v":"213-555-1212"},{"$f":"IF(ISBLANK('FY25-26 Work Plan'!$L$15:$L$15),\"\",'FY25-26 Work Plan'!$L$15:$L$15)","v":"janedoe@preventionusa.com"},{"$f":"IF(ISBLANK('FY25-26 Work Plan'!$E$16:$E$16),\"\",'FY25-26 Work Plan'!$E$16:$E$16)","v":"John/Jane Doe"},{"$f":"IF(ISBLANK('FY25-26 Work Plan'!$I$16:$I$16),\"\",TEXT('FY25-26 Work Plan'!$I$16:$I$16,\"###-###-####\"))","v":"213-555-1212"},{"$f":"IF(ISBLANK('FY25-26 Work Plan'!$L$16:$L$16),\"\",'FY25-26 Work Plan'!$L$16:$L$16)","v":"janedoe@preventionusa.com"},{"$f":"IF(ISBLANK('FY25-26 Work Plan'!$E$17:$E$17),\"\",'FY25-26 Work Plan'!$E$17:$E$17)","v":"John/Jane Doe"},{"$f":"IF(ISBLANK('FY25-26 Work Plan'!$I$17:$I$17),\"\",TEXT('FY25-26 Work Plan'!$I$17:$I$17,\"###-###-####\"))","v":"213-555-1212"},{"$f":"IF(ISBLANK('FY25-26 Work Plan'!$L$17:$L$17),\"\",'FY25-26 Work Plan'!$L$17:$L$17)","v":"j.doe@preventionusa.com"},{"$f":"IF(ISBLANK('FY25-26 Work Plan'!$E$18:$E$18),\"\",'FY25-26 Work Plan'!$E$18:$E$18)","v":"John/Jane Doe"},{"$f":"IF(ISBLANK('FY25-26 Work Plan'!$I$18:$I$18),\"\",TEXT('FY25-26 Work Plan'!$I$18:$I$18,\"###-###-####\"))","v":"213-555-1213"},{"$f":"IF(ISBLANK('FY25-26 Work Plan'!$L$18:$L$18),\"\",'FY25-26 Work Plan'!$L$18:$L$18)","v":"j.doe@preventionusa.com"},{"$f":"IF(ISBLANK('FY25-26 Work Plan'!$E$19:$E$19),\"\",'FY25-26 Work Plan'!$E$19:$E$19)","v":"John/Jane Doe"},{"$f":"IF(ISBLANK('FY25-26 Work Plan'!$I$19:$I$19),\"\",TEXT('FY25-26 Work Plan'!$I$19:$I$19,\"###-###-####\"))","v":"213-555-1213"},{"$f":"IF(ISBLANK('FY25-26 Work Plan'!$L$19:$L$19),\"\",'FY25-26 Work Plan'!$L$19:$L$19)","v":"j.doe@preventionusa.com"},{"$f":"IF(ISBLANK('FY25-26 Work Plan'!$E$23:$E$23),\"\",'FY25-26 Work Plan'!$E$23:$E$23)","v":""},{"$f":"IF(ISBLANK('FY25-26 Work Plan'!$I$23:$I$23),\"\",'FY25-26 Work Plan'!$I$23:$I$23)","v":""},{"$f":"IF(ISBLANK('FY25-26 Work Plan'!$E$24:$E$24),\"\",'FY25-26 Work Plan'!$E$24:$E$24)","v":""},{"$f":"IF(ISBLANK('FY25-26 Work Plan'!$I$24:$I$24),\"\",'FY25-26 Work Plan'!$I$24:$I$24)","v":""},{"$f":"IF(ISBLANK('FY25-26 Work Plan'!$E$25:$E$25),\"\",'FY25-26 Work Plan'!$E$25:$E$25)","v":""},{"$f":"IF(ISBLANK('FY25-26 Work Plan'!$I$25:$I$25),\"\",'FY25-26 Work Plan'!$I$25:$I$25)","v":""},{"$f":"IF(ISBLANK('FY25-26 Work Plan'!$E$26:$E$26),\"\",'FY25-26 Work Plan'!$E$26:$E$26)","v":""},{"$f":"IF(ISBLANK('FY25-26 Work Plan'!$I$26:$I$26),\"\",'FY25-26 Work Plan'!$I$26:$I$26)","v":""},{"$f":"IF(ISBLANK('FY25-26 Work Plan'!$E$27:$E$27),\"\",'FY25-26 Work Plan'!$E$27:$E$27)","v":""},{"$f":"IF(ISBLANK('FY25-26 Work Plan'!$I$27:$I$27),\"\",'FY25-26 Work Plan'!$I$27:$I$27)","v":""},{"$f":"IF(ISBLANK('FY25-26 Work Plan'!$E$28:$E$28),\"\",'FY25-26 Work Plan'!$E$28:$E$28)","v":""},{"$f":"IF(ISBLANK('FY25-26 Work Plan'!$I$28:$I$28),\"\",'FY25-26 Work Plan'!$I$28:$I$28)","v":""},{"$f":"IF(ISBLANK('FY25-26 Work Plan'!$E$29:$E$29),\"\",'FY25-26 Work Plan'!$E$29:$E$29)","v":""},{"$f":"IF(ISBLANK('FY25-26 Work Plan'!$I$29:$I$29),\"\",'FY25-26 Work Plan'!$I$29:$I$29)","v":""},{"$f":"IF(ISBLANK('FY25-26 Work Plan'!$B$30:$B$30),\"\",'FY25-26 Work Plan'!$B$30:$B$30)","v":""},{"$f":"IF(ISBLANK('FY25-26 Work Plan'!$E$30:$E$30),\"\",'FY25-26 Work Plan'!$E$30:$E$30)","v":""},{"$f":"IF(ISBLANK('FY25-26 Work Plan'!$I$30:$I$30),\"\",'FY25-26 Work Plan'!$I$30:$I$30)","v":""},{"$f":"IF(ISBLANK('FY25-26 Work Plan'!$B$31:$B$31),\"\",'FY25-26 Work Plan'!$B$31:$B$31)","v":""},{"$f":"IF(ISBLANK('FY25-26 Work Plan'!$E$31:$E$31),\"\",'FY25-26 Work Plan'!$E$31:$E$31)","v":""},{"$f":"IF(ISBLANK('FY25-26 Work Plan'!$I$31:$I$31),\"\",'FY25-26 Work Plan'!$I$31:$I$31)","v":""},{"$f":"IF(ISBLANK('FY25-26 Work Plan'!$B$32:$B$32),\"\",'FY25-26 Work Plan'!$B$32:$B$32)","v":""},{"$f":"IF(ISBLANK('FY25-26 Work Plan'!$E$32:$E$32),\"\",'FY25-26 Work Plan'!$E$32:$E$32)","v":""},{"$f":"IF(ISBLANK('FY25-26 Work Plan'!$I$32:$I$32),\"\",'FY25-26 Work Plan'!$I$32:$I$32)","v":""},{"$f":"IF(ISBLANK('FY25-26 Work Plan'!#REF!),\"\",'FY25-26 Work Plan'!#REF!)","v":{"$error":"#REF!"}},{"$f":"IF(ISBLANK('FY25-26 Work Plan'!#REF!),\"\",'FY25-26 Work Plan'!#REF!)","v":{"$error":"#REF!"}},{"$f":"IF(ISBLANK('FY25-26 Work Plan'!#REF!),\"\",'FY25-26 Work Plan'!#REF!)","v":{"$error":"#REF!"}},{"$f":"IF(ISBLANK('FY25-26 Work Plan'!#REF!),\"\",'FY25-26 Work Plan'!#REF!)","v":{"$error":"#REF!"}},{"$f":"IF(ISBLANK('FY25-26 Work Plan'!#REF!),\"\",'FY25-26 Work Plan'!#REF!)","v":{"$error":"#REF!"}},{"$f":"IF(ISBLANK('FY25-26 Work Plan'!#REF!),\"\",'FY25-26 Work Plan'!#REF!)","v":{"$error":"#REF!"}},{"$f":"IF(ISBLANK('FY25-26 Work Plan'!#REF!),\"\",'FY25-26 Work Plan'!#REF!)","v":{"$error":"#REF!"}},{"$f":"IF(ISBLANK('FY25-26 Work Plan'!#REF!),\"\",'FY25-26 Work Plan'!#REF!)","v":{"$error":"#REF!"}},{"$f":"IF(ISBLANK('FY25-26 Work Plan'!#REF!),\"\",'FY25-26 Work Plan'!#REF!)","v":{"$error":"#REF!"}}]
[{"$f":"IF(ISBLANK('FY25-26 Work Plan'!$E$2:$E$2),\"\",'FY25-26 Work Plan'!$E$2:$E$2)","v":"Asian American Drug Abuse Programs, Inc. (AADAP)"},{"$f":"IF(ISBLANK('FY25-26 Work Plan'!$L$2:$L$2),\"\",'FY25-26 Work Plan'!$L$2:$L$2)","v":"Prevention Education Program (PEP)"},{"$f":"IF(ISBLANK('FY25-26 Work Plan'!$L$3:$L$3),\"\",'FY25-26 Work Plan'!$L$3:$L$3)","v":""},{"$f":"IF(ISBLANK('FY25-26 Work Plan'!$E$3:$E$3),\"\",'FY25-26 Work Plan'!$E$3:$E$3)","v":"PH-005150 "},{"$f":"IF(ISBLANK('FY25-26 Work Plan'!$E$4:$E$4),\"\",TEXT('FY25-26 Work Plan'!$E$4:$E$4,\"000000\"))","v":"000001"},{"$f":"IF(ISBLANK('FY25-26 Work Plan'!$L$4:$L$4),\"\",'FY25-26 Work Plan'!$L$4:$L$4)","v":""},{"$f":"IF(ISBLANK('FY25-26 Work Plan'!$E$5:$E$5),\"\",'FY25-26 Work Plan'!$E$5:$E$5)","v":"2 - San Fernando Valley"},{"$f":"IF(ISBLANK('FY25-26 Work Plan'!$L$5:$L$5),\"\",'FY25-26 Work Plan'!$L$5:$L$5)","v":""},{"$f":"IF(ISBLANK('FY25-26 Work Plan'!$E$6:$E$6),\"\",'FY25-26 Work Plan'!$E$6:$E$6)","v":"Agoura Hills, Agua Dulce*"},{"$f":"IF(ISBLANK('FY25-26 Work Plan'!$F$7:$F$7),\"\",'FY25-26 Work Plan'!$F$7:$F$7)","v":""},{"$f":"IF(ISBLANK('FY25-26 Work Plan'!$F$8:$F$8),\"\",'FY25-26 Work Plan'!$F$8:$F$8)","v":""},{"$f":"IF(ISBLANK('FY25-26 Work Plan'!$E$9:$E$9),\"\",'FY25-26 Work Plan'!$E$9:$E$9)","v":"123 E Main St., Suite 100 \nAnytown, CA 90000"},{"$f":"IF(ISBLANK('FY25-26 Work Plan'!$L$9:$L$9),\"\",TEXT('FY25-26 Work Plan'!$L$9:$L$9,\"###-###-####\"))","v":"999-999-9999"},{"$f":"IF(ISBLANK('FY25-26 Work Plan'!$L$10:$L$10),\"\",'FY25-26 Work Plan'!$L$10:$L$10)","v":"www.abc1.org"},{"$f":"IF(ISBLANK('FY25-26 Work Plan'!$E$11:$E$11),\"\",'FY25-26 Work Plan'!$E$11:$E$11)","v":"123 E Main St., Suite 100 \nAnytown, CA 90000"},{"$f":"IF(ISBLANK('FY25-26 Work Plan'!$L$11:$L$11),\"\",TEXT('FY25-26 Work Plan'!$L$11:$L$11,\"###-###-####\"))","v":"999-999-9999"},{"$f":"IF(ISBLANK('FY25-26 Work Plan'!$L$12:$L$12),\"\",'FY25-26 Work Plan'!$L$12:$L$12)","v":"www.abc2.org"},{"$f":"IF(ISBLANK('FY25-26 Work Plan'!$E$15:$E$15),\"\",'FY25-26 Work Plan'!$E$15:$E$15)","v":"John/Jane Doe"},{"$f":"IF(ISBLANK('FY25-26 Work Plan'!$I$15:$I$15),\"\",TEXT('FY25-26 Work Plan'!$I$15:$I$15,\"###-###-####\"))","v":"213-555-1212"},{"$f":"IF(ISBLANK('FY25-26 Work Plan'!$L$15:$L$15),\"\",'FY25-26 Work Plan'!$L$15:$L$15)","v":"janedoe@preventionusa.com"},{"$f":"IF(ISBLANK('FY25-26 Work Plan'!$E$16:$E$16),\"\",'FY25-26 Work Plan'!$E$16:$E$16)","v":"John/Jane Doe"},{"$f":"IF(ISBLANK('FY25-26 Work Plan'!$I$16:$I$16),\"\",TEXT('FY25-26 Work Plan'!$I$16:$I$16,\"###-###-####\"))","v":"213-555-1212"},{"$f":"IF(ISBLANK('FY25-26 Work Plan'!$L$16:$L$16),\"\",'FY25-26 Work Plan'!$L$16:$L$16)","v":"janedoe@preventionusa.com"},{"$f":"IF(ISBLANK('FY25-26 Work Plan'!$E$17:$E$17),\"\",'FY25-26 Work Plan'!$E$17:$E$17)","v":"John/Jane Doe"},{"$f":"IF(ISBLANK('FY25-26 Work Plan'!$I$17:$I$17),\"\",TEXT('FY25-26 Work Plan'!$I$17:$I$17,\"###-###-####\"))","v":"213-555-1212"},{"$f":"IF(ISBLANK('FY25-26 Work Plan'!$L$17:$L$17),\"\",'FY25-26 Work Plan'!$L$17:$L$17)","v":"j.doe@preventionusa.com"},{"$f":"IF(ISBLANK('FY25-26 Work Plan'!$E$18:$E$18),\"\",'FY25-26 Work Plan'!$E$18:$E$18)","v":"John/Jane Doe"},{"$f":"IF(ISBLANK('FY25-26 Work Plan'!$I$18:$I$18),\"\",TEXT('FY25-26 Work Plan'!$I$18:$I$18,\"###-###-####\"))","v":"213-555-1213"},{"$f":"IF(ISBLANK('FY25-26 Work Plan'!$L$18:$L$18),\"\",'FY25-26 Work Plan'!$L$18:$L$18)","v":"j.doe@preventionusa.com"},{"$f":"IF(ISBLANK('FY25-26 Work Plan'!$E$19:$E$19),\"\",'FY25-26 Work Plan'!$E$19:$E$19)","v":"John/Jane Doe"},{"$f":"IF(ISBLANK('FY25-26 Work Plan'!$I$19:$I$19),\"\",TEXT('FY25-26 Work Plan'!$I$19:$I$19,\"###-###-####\"))","v":"213-555-1213"},{"$f":"IF(ISBLANK('FY25-26 Work Plan'!$L$19:$L$19),\"\",'FY25-26 Work Plan'!$L$19:$L$19)","v":"j.doe@preventionusa.com"},{"$f":"IF(ISBLANK('FY25-26 Work Plan'!$E$23:$E$23),\"\",'FY25-26 Work Plan'!$E$23:$E$23)","v":""},{"$f":"IF(ISBLANK('FY25-26 Work Plan'!$I$23:$I$23),\"\",'FY25-26 Work Plan'!$I$23:$I$23)","v":""},{"$f":"IF(ISBLANK('FY25-26 Work Plan'!$E$24:$E$24),\"\",'FY25-26 Work Plan'!$E$24:$E$24)","v":""},{"$f":"IF(ISBLANK('FY25-26 Work Plan'!$I$24:$I$24),\"\",'FY25-26 Work Plan'!$I$24:$I$24)","v":""},{"$f":"IF(ISBLANK('FY25-26 Work Plan'!$E$25:$E$25),\"\",'FY25-26 Work Plan'!$E$25:$E$25)","v":""},{"$f":"IF(ISBLANK('FY25-26 Work Plan'!$I$25:$I$25),\"\",'FY25-26 Work Plan'!$I$25:$I$25)","v":""},{"$f":"IF(ISBLANK('FY25-26 Work Plan'!$E$26:$E$26),\"\",'FY25-26 Work Plan'!$E$26:$E$26)","v":""},{"$f":"IF(ISBLANK('FY25-26 Work Plan'!$I$26:$I$26),\"\",'FY25-26 Work Plan'!$I$26:$I$26)","v":""},{"$f":"IF(ISBLANK('FY25-26 Work Plan'!$E$27:$E$27),\"\",'FY25-26 Work Plan'!$E$27:$E$27)","v":""},{"$f":"IF(ISBLANK('FY25-26 Work Plan'!$I$27:$I$27),\"\",'FY25-26 Work Plan'!$I$27:$I$27)","v":""},{"$f":"IF(ISBLANK('FY25-26 Work Plan'!$E$28:$E$28),\"\",'FY25-26 Work Plan'!$E$28:$E$28)","v":""},{"$f":"IF(ISBLANK('FY25-26 Work Plan'!$I$28:$I$28),\"\",'FY25-26 Work Plan'!$I$28:$I$28)","v":""},{"$f":"IF(ISBLANK('FY25-26 Work Plan'!$E$29:$E$29),\"\",'FY25-26 Work Plan'!$E$29:$E$29)","v":""},{"$f":"IF(ISBLANK('FY25-26 Work Plan'!$I$29:$I$29),\"\",'FY25-26 Work Plan'!$I$29:$I$29)","v":""},{"$f":"IF(ISBLANK('FY25-26 Work Plan'!$B$30:$B$30),\"\",'FY25-26 Work Plan'!$B$30:$B$30)","v":""},{"$f":"IF(ISBLANK('FY25-26 Work Plan'!$E$30:$E$30),\"\",'FY25-26 Work Plan'!$E$30:$E$30)","v":""},{"$f":"IF(ISBLANK('FY25-26 Work Plan'!$I$30:$I$30),\"\",'FY25-26 Work Plan'!$I$30:$I$30)","v":""},{"$f":"IF(ISBLANK('FY25-26 Work Plan'!$B$31:$B$31),\"\",'FY25-26 Work Plan'!$B$31:$B$31)","v":""},{"$f":"IF(ISBLANK('FY25-26 Work Plan'!$E$31:$E$31),\"\",'FY25-26 Work Plan'!$E$31:$E$31)","v":""},{"$f":"IF(ISBLANK('FY25-26 Work Plan'!$I$31:$I$31),\"\",'FY25-26 Work Plan'!$I$31:$I$31)","v":""},{"$f":"IF(ISBLANK('FY25-26 Work Plan'!$B$32:$B$32),\"\",'FY25-26 Work Plan'!$B$32:$B$32)","v":""},{"$f":"IF(ISBLANK('FY25-26 Work Plan'!$E$32:$E$32),\"\",'FY25-26 Work Plan'!$E$32:$E$32)","v":""},{"$f":"IF(ISBLANK('FY25-26 Work Plan'!$I$32:$I$32),\"\",'FY25-26 Work Plan'!$I$32:$I$32)","v":""},{"$f":"IF(ISBLANK('FY25-26 Work Plan'!#REF!),\"\",'FY25-26 Work Plan'!#REF!)","v":{"$error":"#REF!"}},{"$f":"IF(ISBLANK('FY25-26 Work Plan'!#REF!),\"\",'FY25-26 Work Plan'!#REF!)","v":{"$error":"#REF!"}},{"$f":"IF(ISBLANK('FY25-26 Work Plan'!#REF!),\"\",'FY25-26 Work Plan'!#REF!)","v":{"$error":"#REF!"}},{"$f":"IF(ISBLANK('FY25-26 Work Plan'!#REF!),\"\",'FY25-26 Work Plan'!#REF!)","v":{"$error":"#REF!"}},{"$f":"IF(ISBLANK('FY25-26 Work Plan'!#REF!),\"\",'FY25-26 Work Plan'!#REF!)","v":{"$error":"#REF!"}},{"$f":"IF(ISBLANK('FY25-26 Work Plan'!#REF!),\"\",'FY25-26 Work Plan'!#REF!)","v":{"$error":"#REF!"}},{"$f":"IF(ISBLANK('FY25-26 Work Plan'!#REF!),\"\",'FY25-26 Work Plan'!#REF!)","v":{"$error":"#REF!"}},{"$f":"IF(ISBLANK('FY25-26 Work Plan'!#REF!),\"\",'FY25-26 Work Plan'!#REF!)","v":{"$error":"#REF!"}},{"$f":"IF(ISBLANK('FY25-26 Work Plan'!#REF!),\"\",'FY25-26 Work Plan'!#REF!)","v":{"$error":"#REF!"}}]
[{"$f":"IF(ISBLANK('FY25-26 Work Plan'!$E$2:$E$2),\"\",'FY25-26 Work Plan'!$E$2:$E$2)","v":"Asian American Drug Abuse Programs, Inc. (AADAP)"},{"$f":"IF(ISBLANK('FY25-26 Work Plan'!$L$2:$L$2),\"\",'FY25-26 Work Plan'!$L$2:$L$2)","v":"Prevention Education Program (PEP)"},{"$f":"IF(ISBLANK('FY25-26 Work Plan'!$L$3:$L$3),\"\",'FY25-26 Work Plan'!$L$3:$L$3)","v":""},{"$f":"IF(ISBLANK('FY25-26 Work Plan'!$E$3:$E$3),\"\",'FY25-26 Work Plan'!$E$3:$E$3)","v":"PH-005150 "},{"$f":"IF(ISBLANK('FY25-26 Work Plan'!$E$4:$E$4),\"\",TEXT('FY25-26 Work Plan'!$E$4:$E$4,\"000000\"))","v":"000001"},{"$f":"IF(ISBLANK('FY25-26 Work Plan'!$L$4:$L$4),\"\",'FY25-26 Work Plan'!$L$4:$L$4)","v":""},{"$f":"IF(ISBLANK('FY25-26 Work Plan'!$E$5:$E$5),\"\",'FY25-26 Work Plan'!$E$5:$E$5)","v":"2 - San Fernando Valley"},{"$f":"IF(ISBLANK('FY25-26 Work Plan'!$L$5:$L$5),\"\",'FY25-26 Work Plan'!$L$5:$L$5)","v":""},{"$f":"IF(ISBLANK('FY25-26 Work Plan'!$E$6:$E$6),\"\",'FY25-26 Work Plan'!$E$6:$E$6)","v":"Agoura Hills, Agua Dulce*"},{"$f":"IF(ISBLANK('FY25-26 Work Plan'!$F$7:$F$7),\"\",'FY25-26 Work Plan'!$F$7:$F$7)","v":""},{"$f":"IF(ISBLANK('FY25-26 Work Plan'!$F$8:$F$8),\"\",'FY25-26 Work Plan'!$F$8:$F$8)","v":""},{"$f":"IF(ISBLANK('FY25-26 Work Plan'!$E$9:$E$9),\"\",'FY25-26 Work Plan'!$E$9:$E$9)","v":"123 E Main St., Suite 100 \nAnytown, CA 90000"},{"$f":"IF(ISBLANK('FY25-26 Work Plan'!$L$9:$L$9),\"\",TEXT('FY25-26 Work Plan'!$L$9:$L$9,\"###-###-####\"))","v":"999-999-9999"},{"$f":"IF(ISBLANK('FY25-26 Work Plan'!$L$10:$L$10),\"\",'FY25-26 Work Plan'!$L$10:$L$10)","v":"www.abc1.org"},{"$f":"IF(ISBLANK('FY25-26 Work Plan'!$E$11:$E$11),\"\",'FY25-26 Work Plan'!$E$11:$E$11)","v":"123 E Main St., Suite 100 \nAnytown, CA 90000"},{"$f":"IF(ISBLANK('FY25-26 Work Plan'!$L$11:$L$11),\"\",TEXT('FY25-26 Work Plan'!$L$11:$L$11,\"###-###-####\"))","v":"999-999-9999"},{"$f":"IF(ISBLANK('FY25-26 Work Plan'!$L$12:$L$12),\"\",'FY25-26 Work Plan'!$L$12:$L$12)","v":"www.abc2.org"},{"$f":"IF(ISBLANK('FY25-26 Work Plan'!$E$15:$E$15),\"\",'FY25-26 Work Plan'!$E$15:$E$15)","v":"John/Jane Doe"},{"$f":"IF(ISBLANK('FY25-26 Work Plan'!$I$15:$I$15),\"\",TEXT('FY25-26 Work Plan'!$I$15:$I$15,\"###-###-####\"))","v":"213-555-1212"},{"$f":"IF(ISBLANK('FY25-26 Work Plan'!$L$15:$L$15),\"\",'FY25-26 Work Plan'!$L$15:$L$15)","v":"janedoe@preventionusa.com"},{"$f":"IF(ISBLANK('FY25-26 Work Plan'!$E$16:$E$16),\"\",'FY25-26 Work Plan'!$E$16:$E$16)","v":"John/Jane Doe"},{"$f":"IF(ISBLANK('FY25-26 Work Plan'!$I$16:$I$16),\"\",TEXT('FY25-26 Work Plan'!$I$16:$I$16,\"###-###-####\"))","v":"213-555-1212"},{"$f":"IF(ISBLANK('FY25-26 Work Plan'!$L$16:$L$16),\"\",'FY25-26 Work Plan'!$L$16:$L$16)","v":"janedoe@preventionusa.com"},{"$f":"IF(ISBLANK('FY25-26 Work Plan'!$E$17:$E$17),\"\",'FY25-26 Work Plan'!$E$17:$E$17)","v":"John/Jane Doe"},{"$f":"IF(ISBLANK('FY25-26 Work Plan'!$I$17:$I$17),\"\",TEXT('FY25-26 Work Plan'!$I$17:$I$17,\"###-###-####\"))","v":"213-555-1212"},{"$f":"IF(ISBLANK('FY25-26 Work Plan'!$L$17:$L$17),\"\",'FY25-26 Work Plan'!$L$17:$L$17)","v":"j.doe@preventionusa.com"},{"$f":"IF(ISBLANK('FY25-26 Work Plan'!$E$18:$E$18),\"\",'FY25-26 Work Plan'!$E$18:$E$18)","v":"John/Jane Doe"},{"$f":"IF(ISBLANK('FY25-26 Work Plan'!$I$18:$I$18),\"\",TEXT('FY25-26 Work Plan'!$I$18:$I$18,\"###-###-####\"))","v":"213-555-1213"},{"$f":"IF(ISBLANK('FY25-26 Work Plan'!$L$18:$L$18),\"\",'FY25-26 Work Plan'!$L$18:$L$18)","v":"j.doe@preventionusa.com"},{"$f":"IF(ISBLANK('FY25-26 Work Plan'!$E$19:$E$19),\"\",'FY25-26 Work Plan'!$E$19:$E$19)","v":"John/Jane Doe"},{"$f":"IF(ISBLANK('FY25-26 Work Plan'!$I$19:$I$19),\"\",TEXT('FY25-26 Work Plan'!$I$19:$I$19,\"###-###-####\"))","v":"213-555-1213"},{"$f":"IF(ISBLANK('FY25-26 Work Plan'!$L$19:$L$19),\"\",'FY25-26 Work Plan'!$L$19:$L$19)","v":"j.doe@preventionusa.com"},{"$f":"IF(ISBLANK('FY25-26 Work Plan'!$E$23:$E$23),\"\",'FY25-26 Work Plan'!$E$23:$E$23)","v":""},{"$f":"IF(ISBLANK('FY25-26 Work Plan'!$I$23:$I$23),\"\",'FY25-26 Work Plan'!$I$23:$I$23)","v":""},{"$f":"IF(ISBLANK('FY25-26 Work Plan'!$E$24:$E$24),\"\",'FY25-26 Work Plan'!$E$24:$E$24)","v":""},{"$f":"IF(ISBLANK('FY25-26 Work Plan'!$I$24:$I$24),\"\",'FY25-26 Work Plan'!$I$24:$I$24)","v":""},{"$f":"IF(ISBLANK('FY25-26 Work Plan'!$E$25:$E$25),\"\",'FY25-26 Work Plan'!$E$25:$E$25)","v":""},{"$f":"IF(ISBLANK('FY25-26 Work Plan'!$I$25:$I$25),\"\",'FY25-26 Work Plan'!$I$25:$I$25)","v":""},{"$f":"IF(ISBLANK('FY25-26 Work Plan'!$E$26:$E$26),\"\",'FY25-26 Work Plan'!$E$26:$E$26)","v":""},{"$f":"IF(ISBLANK('FY25-26 Work Plan'!$I$26:$I$26),\"\",'FY25-26 Work Plan'!$I$26:$I$26)","v":""},{"$f":"IF(ISBLANK('FY25-26 Work Plan'!$E$27:$E$27),\"\",'FY25-26 Work Plan'!$E$27:$E$27)","v":""},{"$f":"IF(ISBLANK('FY25-26 Work Plan'!$I$27:$I$27),\"\",'FY25-26 Work Plan'!$I$27:$I$27)","v":""},{"$f":"IF(ISBLANK('FY25-26 Work Plan'!$E$28:$E$28),\"\",'FY25-26 Work Plan'!$E$28:$E$28)","v":""},{"$f":"IF(ISBLANK('FY25-26 Work Plan'!$I$28:$I$28),\"\",'FY25-26 Work Plan'!$I$28:$I$28)","v":""},{"$f":"IF(ISBLANK('FY25-26 Work Plan'!$E$29:$E$29),\"\",'FY25-26 Work Plan'!$E$29:$E$29)","v":""},{"$f":"IF(ISBLANK('FY25-26 Work Plan'!$I$29:$I$29),\"\",'FY25-26 Work Plan'!$I$29:$I$29)","v":""},{"$f":"IF(ISBLANK('FY25-26 Work Plan'!$B$30:$B$30),\"\",'FY25-26 Work Plan'!$B$30:$B$30)","v":""},{"$f":"IF(ISBLANK('FY25-26 Work Plan'!$E$30:$E$30),\"\",'FY25-26 Work Plan'!$E$30:$E$30)","v":""},{"$f":"IF(ISBLANK('FY25-26 Work Plan'!$I$30:$I$30),\"\",'FY25-26 Work Plan'!$I$30:$I$30)","v":""},{"$f":"IF(ISBLANK('FY25-26 Work Plan'!$B$31:$B$31),\"\",'FY25-26 Work Plan'!$B$31:$B$31)","v":""},{"$f":"IF(ISBLANK('FY25-26 Work Plan'!$E$31:$E$31),\"\",'FY25-26 Work Plan'!$E$31:$E$31)","v":""},{"$f":"IF(ISBLANK('FY25-26 Work Plan'!$I$31:$I$31),\"\",'FY25-26 Work Plan'!$I$31:$I$31)","v":""},{"$f":"IF(ISBLANK('FY25-26 Work Plan'!$B$32:$B$32),\"\",'FY25-26 Work Plan'!$B$32:$B$32)","v":""},{"$f":"IF(ISBLANK('FY25-26 Work Plan'!$E$32:$E$32),\"\",'FY25-26 Work Plan'!$E$32:$E$32)","v":""},{"$f":"IF(ISBLANK('FY25-26 Work Plan'!$I$32:$I$32),\"\",'FY25-26 Work Plan'!$I$32:$I$32)","v":""},{"$f":"IF(ISBLANK('FY25-26 Work Plan'!#REF!),\"\",'FY25-26 Work Plan'!#REF!)","v":{"$error":"#REF!"}},{"$f":"IF(ISBLANK('FY25-26 Work Plan'!#REF!),\"\",'FY25-26 Work Plan'!#REF!)","v":{"$error":"#REF!"}},{"$f":"IF(ISBLANK('FY25-26 Work Plan'!#REF!),\"\",'FY25-26 Work Plan'!#REF!)","v":{"$error":"#REF!"}},{"$f":"IF(ISBLANK('FY25-26 Work Plan'!#REF!),\"\",'FY25-26 Work Plan'!#REF!)","v":{"$error":"#REF!"}},{"$f":"IF(ISBLANK('FY25-26 Work Plan'!#REF!),\"\",'FY25-26 Work Plan'!#REF!)","v":{"$error":"#REF!"}},{"$f":"IF(ISBLANK('FY25-26 Work Plan'!#REF!),\"\",'FY25-26 Work Plan'!#REF!)","v":{"$error":"#REF!"}},{"$f":"IF(ISBLANK('FY25-26 Work Plan'!#REF!),\"\",'FY25-26 Work Plan'!#REF!)","v":{"$error":"#REF!"}},{"$f":"IF(ISBLANK('FY25-26 Work Plan'!#REF!),\"\",'FY25-26 Work Plan'!#REF!)","v":{"$error":"#REF!"}},{"$f":"IF(ISBLANK('FY25-26 Work Plan'!#REF!),\"\",'FY25-26 Work Plan'!#REF!)","v":{"$error":"#REF!"}}]
[{"$f":"IF(ISBLANK('FY25-26 Work Plan'!$E$2:$E$2),\"\",'FY25-26 Work Plan'!$E$2:$E$2)","v":"Asian American Drug Abuse Programs, Inc. (AADAP)"},{"$f":"IF(ISBLANK('FY25-26 Work Plan'!$L$2:$L$2),\"\",'FY25-26 Work Plan'!$L$2:$L$2)","v":"Prevention Education Program (PEP)"},{"$f":"IF(ISBLANK('FY25-26 Work Plan'!$L$3:$L$3),\"\",'FY25-26 Work Plan'!$L$3:$L$3)","v":""},{"$f":"IF(ISBLANK('FY25-26 Work Plan'!$E$3:$E$3),\"\",'FY25-26 Work Plan'!$E$3:$E$3)","v":"PH-005150 "},{"$f":"IF(ISBLANK('FY25-26 Work Plan'!$E$4:$E$4),\"\",TEXT('FY25-26 Work Plan'!$E$4:$E$4,\"000000\"))","v":"000001"},{"$f":"IF(ISBLANK('FY25-26 Work Plan'!$L$4:$L$4),\"\",'FY25-26 Work Plan'!$L$4:$L$4)","v":""},{"$f":"IF(ISBLANK('FY25-26 Work Plan'!$E$5:$E$5),\"\",'FY25-26 Work Plan'!$E$5:$E$5)","v":"2 - San Fernando Valley"},{"$f":"IF(ISBLANK('FY25-26 Work Plan'!$L$5:$L$5),\"\",'FY25-26 Work Plan'!$L$5:$L$5)","v":""},{"$f":"IF(ISBLANK('FY25-26 Work Plan'!$E$6:$E$6),\"\",'FY25-26 Work Plan'!$E$6:$E$6)","v":"Agoura Hills, Agua Dulce*"},{"$f":"IF(ISBLANK('FY25-26 Work Plan'!$F$7:$F$7),\"\",'FY25-26 Work Plan'!$F$7:$F$7)","v":""},{"$f":"IF(ISBLANK('FY25-26 Work Plan'!$F$8:$F$8),\"\",'FY25-26 Work Plan'!$F$8:$F$8)","v":""},{"$f":"IF(ISBLANK('FY25-26 Work Plan'!$E$9:$E$9),\"\",'FY25-26 Work Plan'!$E$9:$E$9)","v":"123 E Main St., Suite 100 \nAnytown, CA 90000"},{"$f":"IF(ISBLANK('FY25-26 Work Plan'!$L$9:$L$9),\"\",TEXT('FY25-26 Work Plan'!$L$9:$L$9,\"###-###-####\"))","v":"999-999-9999"},{"$f":"IF(ISBLANK('FY25-26 Work Plan'!$L$10:$L$10),\"\",'FY25-26 Work Plan'!$L$10:$L$10)","v":"www.abc1.org"},{"$f":"IF(ISBLANK('FY25-26 Work Plan'!$E$11:$E$11),\"\",'FY25-26 Work Plan'!$E$11:$E$11)","v":"123 E Main St., Suite 100 \nAnytown, CA 90000"},{"$f":"IF(ISBLANK('FY25-26 Work Plan'!$L$11:$L$11),\"\",TEXT('FY25-26 Work Plan'!$L$11:$L$11,\"###-###-####\"))","v":"999-999-9999"},{"$f":"IF(ISBLANK('FY25-26 Work Plan'!$L$12:$L$12),\"\",'FY25-26 Work Plan'!$L$12:$L$12)","v":"www.abc2.org"},{"$f":"IF(ISBLANK('FY25-26 Work Plan'!$E$15:$E$15),\"\",'FY25-26 Work Plan'!$E$15:$E$15)","v":"John/Jane Doe"},{"$f":"IF(ISBLANK('FY25-26 Work Plan'!$I$15:$I$15),\"\",TEXT('FY25-26 Work Plan'!$I$15:$I$15,\"###-###-####\"))","v":"213-555-1212"},{"$f":"IF(ISBLANK('FY25-26 Work Plan'!$L$15:$L$15),\"\",'FY25-26 Work Plan'!$L$15:$L$15)","v":"janedoe@preventionusa.com"},{"$f":"IF(ISBLANK('FY25-26 Work Plan'!$E$16:$E$16),\"\",'FY25-26 Work Plan'!$E$16:$E$16)","v":"John/Jane Doe"},{"$f":"IF(ISBLANK('FY25-26 Work Plan'!$I$16:$I$16),\"\",TEXT('FY25-26 Work Plan'!$I$16:$I$16,\"###-###-####\"))","v":"213-555-1212"},{"$f":"IF(ISBLANK('FY25-26 Work Plan'!$L$16:$L$16),\"\",'FY25-26 Work Plan'!$L$16:$L$16)","v":"janedoe@preventionusa.com"},{"$f":"IF(ISBLANK('FY25-26 Work Plan'!$E$17:$E$17),\"\",'FY25-26 Work Plan'!$E$17:$E$17)","v":"John/Jane Doe"},{"$f":"IF(ISBLANK('FY25-26 Work Plan'!$I$17:$I$17),\"\",TEXT('FY25-26 Work Plan'!$I$17:$I$17,\"###-###-####\"))","v":"213-555-1212"},{"$f":"IF(ISBLANK('FY25-26 Work Plan'!$L$17:$L$17),\"\",'FY25-26 Work Plan'!$L$17:$L$17)","v":"j.doe@preventionusa.com"},{"$f":"IF(ISBLANK('FY25-26 Work Plan'!$E$18:$E$18),\"\",'FY25-26 Work Plan'!$E$18:$E$18)","v":"John/Jane Doe"},{"$f":"IF(ISBLANK('FY25-26 Work Plan'!$I$18:$I$18),\"\",TEXT('FY25-26 Work Plan'!$I$18:$I$18,\"###-###-####\"))","v":"213-555-1213"},{"$f":"IF(ISBLANK('FY25-26 Work Plan'!$L$18:$L$18),\"\",'FY25-26 Work Plan'!$L$18:$L$18)","v":"j.doe@preventionusa.com"},{"$f":"IF(ISBLANK('FY25-26 Work Plan'!$E$19:$E$19),\"\",'FY25-26 Work Plan'!$E$19:$E$19)","v":"John/Jane Doe"},{"$f":"IF(ISBLANK('FY25-26 Work Plan'!$I$19:$I$19),\"\",TEXT('FY25-26 Work Plan'!$I$19:$I$19,\"###-###-####\"))","v":"213-555-1213"},{"$f":"IF(ISBLANK('FY25-26 Work Plan'!$L$19:$L$19),\"\",'FY25-26 Work Plan'!$L$19:$L$19)","v":"j.doe@preventionusa.com"},{"$f":"IF(ISBLANK('FY25-26 Work Plan'!$E$23:$E$23),\"\",'FY25-26 Work Plan'!$E$23:$E$23)","v":""},{"$f":"IF(ISBLANK('FY25-26 Work Plan'!$I$23:$I$23),\"\",'FY25-26 Work Plan'!$I$23:$I$23)","v":""},{"$f":"IF(ISBLANK('FY25-26 Work Plan'!$E$24:$E$24),\"\",'FY25-26 Work Plan'!$E$24:$E$24)","v":""},{"$f":"IF(ISBLANK('FY25-26 Work Plan'!$I$24:$I$24),\"\",'FY25-26 Work Plan'!$I$24:$I$24)","v":""},{"$f":"IF(ISBLANK('FY25-26 Work Plan'!$E$25:$E$25),\"\",'FY25-26 Work Plan'!$E$25:$E$25)","v":""},{"$f":"IF(ISBLANK('FY25-26 Work Plan'!$I$25:$I$25),\"\",'FY25-26 Work Plan'!$I$25:$I$25)","v":""},{"$f":"IF(ISBLANK('FY25-26 Work Plan'!$E$26:$E$26),\"\",'FY25-26 Work Plan'!$E$26:$E$26)","v":""},{"$f":"IF(ISBLANK('FY25-26 Work Plan'!$I$26:$I$26),\"\",'FY25-26 Work Plan'!$I$26:$I$26)","v":""},{"$f":"IF(ISBLANK('FY25-26 Work Plan'!$E$27:$E$27),\"\",'FY25-26 Work Plan'!$E$27:$E$27)","v":""},{"$f":"IF(ISBLANK('FY25-26 Work Plan'!$I$27:$I$27),\"\",'FY25-26 Work Plan'!$I$27:$I$27)","v":""},{"$f":"IF(ISBLANK('FY25-26 Work Plan'!$E$28:$E$28),\"\",'FY25-26 Work Plan'!$E$28:$E$28)","v":""},{"$f":"IF(ISBLANK('FY25-26 Work Plan'!$I$28:$I$28),\"\",'FY25-26 Work Plan'!$I$28:$I$28)","v":""},{"$f":"IF(ISBLANK('FY25-26 Work Plan'!$E$29:$E$29),\"\",'FY25-26 Work Plan'!$E$29:$E$29)","v":""},{"$f":"IF(ISBLANK('FY25-26 Work Plan'!$I$29:$I$29),\"\",'FY25-26 Work Plan'!$I$29:$I$29)","v":""},{"$f":"IF(ISBLANK('FY25-26 Work Plan'!$B$30:$B$30),\"\",'FY25-26 Work Plan'!$B$30:$B$30)","v":""},{"$f":"IF(ISBLANK('FY25-26 Work Plan'!$E$30:$E$30),\"\",'FY25-26 Work Plan'!$E$30:$E$30)","v":""},{"$f":"IF(ISBLANK('FY25-26 Work Plan'!$I$30:$I$30),\"\",'FY25-26 Work Plan'!$I$30:$I$30)","v":""},{"$f":"IF(ISBLANK('FY25-26 Work Plan'!$B$31:$B$31),\"\",'FY25-26 Work Plan'!$B$31:$B$31)","v":""},{"$f":"IF(ISBLANK('FY25-26 Work Plan'!$E$31:$E$31),\"\",'FY25-26 Work Plan'!$E$31:$E$31)","v":""},{"$f":"IF(ISBLANK('FY25-26 Work Plan'!$I$31:$I$31),\"\",'FY25-26 Work Plan'!$I$31:$I$31)","v":""},{"$f":"IF(ISBLANK('FY25-26 Work Plan'!$B$32:$B$32),\"\",'FY25-26 Work Plan'!$B$32:$B$32)","v":""},{"$f":"IF(ISBLANK('FY25-26 Work Plan'!$E$32:$E$32),\"\",'FY25-26 Work Plan'!$E$32:$E$32)","v":""},{"$f":"IF(ISBLANK('FY25-26 Work Plan'!$I$32:$I$32),\"\",'FY25-26 Work Plan'!$I$32:$I$32)","v":""},{"$f":"IF(ISBLANK('FY25-26 Work Plan'!#REF!),\"\",'FY25-26 Work Plan'!#REF!)","v":{"$error":"#REF!"}},{"$f":"IF(ISBLANK('FY25-26 Work Plan'!#REF!),\"\",'FY25-26 Work Plan'!#REF!)","v":{"$error":"#REF!"}},{"$f":"IF(ISBLANK('FY25-26 Work Plan'!#REF!),\"\",'FY25-26 Work Plan'!#REF!)","v":{"$error":"#REF!"}},{"$f":"IF(ISBLANK('FY25-26 Work Plan'!#REF!),\"\",'FY25-26 Work Plan'!#REF!)","v":{"$error":"#REF!"}},{"$f":"IF(ISBLANK('FY25-26 Work Plan'!#REF!),\"\",'FY25-26 Work Plan'!#REF!)","v":{"$error":"#REF!"}},{"$f":"IF(ISBLANK('FY25-26 Work Plan'!#REF!),\"\",'FY25-26 Work Plan'!#REF!)","v":{"$error":"#REF!"}},{"$f":"IF(ISBLANK('FY25-26 Work Plan'!#REF!),\"\",'FY25-26 Work Plan'!#REF!)","v":{"$error":"#REF!"}},{"$f":"IF(ISBLANK('FY25-26 Work Plan'!#REF!),\"\",'FY25-26 Work Plan'!#REF!)","v":{"$error":"#REF!"}},{"$f":"IF(ISBLANK('FY25-26 Work Plan'!#REF!),\"\",'FY25-26 Work Plan'!#REF!)","v":{"$error":"#REF!"}}]
[{"$f":"IF(ISBLANK('FY25-26 Work Plan'!$E$2:$E$2),\"\",'FY25-26 Work Plan'!$E$2:$E$2)","v":"Asian American Drug Abuse Programs, Inc. (AADAP)"},{"$f":"IF(ISBLANK('FY25-26 Work Plan'!$L$2:$L$2),\"\",'FY25-26 Work Plan'!$L$2:$L$2)","v":"Prevention Education Program (PEP)"},{"$f":"IF(ISBLANK('FY25-26 Work Plan'!$L$3:$L$3),\"\",'FY25-26 Work Plan'!$L$3:$L$3)","v":""},{"$f":"IF(ISBLANK('FY25-26 Work Plan'!$E$3:$E$3),\"\",'FY25-26 Work Plan'!$E$3:$E$3)","v":"PH-005150 "},{"$f":"IF(ISBLANK('FY25-26 Work Plan'!$E$4:$E$4),\"\",TEXT('FY25-26 Work Plan'!$E$4:$E$4,\"000000\"))","v":"000001"},{"$f":"IF(ISBLANK('FY25-26 Work Plan'!$L$4:$L$4),\"\",'FY25-26 Work Plan'!$L$4:$L$4)","v":""},{"$f":"IF(ISBLANK('FY25-26 Work Plan'!$E$5:$E$5),\"\",'FY25-26 Work Plan'!$E$5:$E$5)","v":"2 - San Fernando Valley"},{"$f":"IF(ISBLANK('FY25-26 Work Plan'!$L$5:$L$5),\"\",'FY25-26 Work Plan'!$L$5:$L$5)","v":""},{"$f":"IF(ISBLANK('FY25-26 Work Plan'!$E$6:$E$6),\"\",'FY25-26 Work Plan'!$E$6:$E$6)","v":"Agoura Hills, Agua Dulce*"},{"$f":"IF(ISBLANK('FY25-26 Work Plan'!$F$7:$F$7),\"\",'FY25-26 Work Plan'!$F$7:$F$7)","v":""},{"$f":"IF(ISBLANK('FY25-26 Work Plan'!$F$8:$F$8),\"\",'FY25-26 Work Plan'!$F$8:$F$8)","v":""},{"$f":"IF(ISBLANK('FY25-26 Work Plan'!$E$9:$E$9),\"\",'FY25-26 Work Plan'!$E$9:$E$9)","v":"123 E Main St., Suite 100 \nAnytown, CA 90000"},{"$f":"IF(ISBLANK('FY25-26 Work Plan'!$L$9:$L$9),\"\",TEXT('FY25-26 Work Plan'!$L$9:$L$9,\"###-###-####\"))","v":"999-999-9999"},{"$f":"IF(ISBLANK('FY25-26 Work Plan'!$L$10:$L$10),\"\",'FY25-26 Work Plan'!$L$10:$L$10)","v":"www.abc1.org"},{"$f":"IF(ISBLANK('FY25-26 Work Plan'!$E$11:$E$11),\"\",'FY25-26 Work Plan'!$E$11:$E$11)","v":"123 E Main St., Suite 100 \nAnytown, CA 90000"},{"$f":"IF(ISBLANK('FY25-26 Work Plan'!$L$11:$L$11),\"\",TEXT('FY25-26 Work Plan'!$L$11:$L$11,\"###-###-####\"))","v":"999-999-9999"},{"$f":"IF(ISBLANK('FY25-26 Work Plan'!$L$12:$L$12),\"\",'FY25-26 Work Plan'!$L$12:$L$12)","v":"www.abc2.org"},{"$f":"IF(ISBLANK('FY25-26 Work Plan'!$E$15:$E$15),\"\",'FY25-26 Work Plan'!$E$15:$E$15)","v":"John/Jane Doe"},{"$f":"IF(ISBLANK('FY25-26 Work Plan'!$I$15:$I$15),\"\",TEXT('FY25-26 Work Plan'!$I$15:$I$15,\"###-###-####\"))","v":"213-555-1212"},{"$f":"IF(ISBLANK('FY25-26 Work Plan'!$L$15:$L$15),\"\",'FY25-26 Work Plan'!$L$15:$L$15)","v":"janedoe@preventionusa.com"},{"$f":"IF(ISBLANK('FY25-26 Work Plan'!$E$16:$E$16),\"\",'FY25-26 Work Plan'!$E$16:$E$16)","v":"John/Jane Doe"},{"$f":"IF(ISBLANK('FY25-26 Work Plan'!$I$16:$I$16),\"\",TEXT('FY25-26 Work Plan'!$I$16:$I$16,\"###-###-####\"))","v":"213-555-1212"},{"$f":"IF(ISBLANK('FY25-26 Work Plan'!$L$16:$L$16),\"\",'FY25-26 Work Plan'!$L$16:$L$16)","v":"janedoe@preventionusa.com"},{"$f":"IF(ISBLANK('FY25-26 Work Plan'!$E$17:$E$17),\"\",'FY25-26 Work Plan'!$E$17:$E$17)","v":"John/Jane Doe"},{"$f":"IF(ISBLANK('FY25-26 Work Plan'!$I$17:$I$17),\"\",TEXT('FY25-26 Work Plan'!$I$17:$I$17,\"###-###-####\"))","v":"213-555-1212"},{"$f":"IF(ISBLANK('FY25-26 Work Plan'!$L$17:$L$17),\"\",'FY25-26 Work Plan'!$L$17:$L$17)","v":"j.doe@preventionusa.com"},{"$f":"IF(ISBLANK('FY25-26 Work Plan'!$E$18:$E$18),\"\",'FY25-26 Work Plan'!$E$18:$E$18)","v":"John/Jane Doe"},{"$f":"IF(ISBLANK('FY25-26 Work Plan'!$I$18:$I$18),\"\",TEXT('FY25-26 Work Plan'!$I$18:$I$18,\"###-###-####\"))","v":"213-555-1213"},{"$f":"IF(ISBLANK('FY25-26 Work Plan'!$L$18:$L$18),\"\",'FY25-26 Work Plan'!$L$18:$L$18)","v":"j.doe@preventionusa.com"},{"$f":"IF(ISBLANK('FY25-26 Work Plan'!$E$19:$E$19),\"\",'FY25-26 Work Plan'!$E$19:$E$19)","v":"John/Jane Doe"},{"$f":"IF(ISBLANK('FY25-26 Work Plan'!$I$19:$I$19),\"\",TEXT('FY25-26 Work Plan'!$I$19:$I$19,\"###-###-####\"))","v":"213-555-1213"},{"$f":"IF(ISBLANK('FY25-26 Work Plan'!$L$19:$L$19),\"\",'FY25-26 Work Plan'!$L$19:$L$19)","v":"j.doe@preventionusa.com"},{"$f":"IF(ISBLANK('FY25-26 Work Plan'!$E$23:$E$23),\"\",'FY25-26 Work Plan'!$E$23:$E$23)","v":""},{"$f":"IF(ISBLANK('FY25-26 Work Plan'!$I$23:$I$23),\"\",'FY25-26 Work Plan'!$I$23:$I$23)","v":""},{"$f":"IF(ISBLANK('FY25-26 Work Plan'!$E$24:$E$24),\"\",'FY25-26 Work Plan'!$E$24:$E$24)","v":""},{"$f":"IF(ISBLANK('FY25-26 Work Plan'!$I$24:$I$24),\"\",'FY25-26 Work Plan'!$I$24:$I$24)","v":""},{"$f":"IF(ISBLANK('FY25-26 Work Plan'!$E$25:$E$25),\"\",'FY25-26 Work Plan'!$E$25:$E$25)","v":""},{"$f":"IF(ISBLANK('FY25-26 Work Plan'!$I$25:$I$25),\"\",'FY25-26 Work Plan'!$I$25:$I$25)","v":""},{"$f":"IF(ISBLANK('FY25-26 Work Plan'!$E$26:$E$26),\"\",'FY25-26 Work Plan'!$E$26:$E$26)","v":""},{"$f":"IF(ISBLANK('FY25-26 Work Plan'!$I$26:$I$26),\"\",'FY25-26 Work Plan'!$I$26:$I$26)","v":""},{"$f":"IF(ISBLANK('FY25-26 Work Plan'!$E$27:$E$27),\"\",'FY25-26 Work Plan'!$E$27:$E$27)","v":""},{"$f":"IF(ISBLANK('FY25-26 Work Plan'!$I$27:$I$27),\"\",'FY25-26 Work Plan'!$I$27:$I$27)","v":""},{"$f":"IF(ISBLANK('FY25-26 Work Plan'!$E$28:$E$28),\"\",'FY25-26 Work Plan'!$E$28:$E$28)","v":""},{"$f":"IF(ISBLANK('FY25-26 Work Plan'!$I$28:$I$28),\"\",'FY25-26 Work Plan'!$I$28:$I$28)","v":""},{"$f":"IF(ISBLANK('FY25-26 Work Plan'!$E$29:$E$29),\"\",'FY25-26 Work Plan'!$E$29:$E$29)","v":""},{"$f":"IF(ISBLANK('FY25-26 Work Plan'!$I$29:$I$29),\"\",'FY25-26 Work Plan'!$I$29:$I$29)","v":""},{"$f":"IF(ISBLANK('FY25-26 Work Plan'!$B$30:$B$30),\"\",'FY25-26 Work Plan'!$B$30:$B$30)","v":""},{"$f":"IF(ISBLANK('FY25-26 Work Plan'!$E$30:$E$30),\"\",'FY25-26 Work Plan'!$E$30:$E$30)","v":""},{"$f":"IF(ISBLANK('FY25-26 Work Plan'!$I$30:$I$30),\"\",'FY25-26 Work Plan'!$I$30:$I$30)","v":""},{"$f":"IF(ISBLANK('FY25-26 Work Plan'!$B$31:$B$31),\"\",'FY25-26 Work Plan'!$B$31:$B$31)","v":""},{"$f":"IF(ISBLANK('FY25-26 Work Plan'!$E$31:$E$31),\"\",'FY25-26 Work Plan'!$E$31:$E$31)","v":""},{"$f":"IF(ISBLANK('FY25-26 Work Plan'!$I$31:$I$31),\"\",'FY25-26 Work Plan'!$I$31:$I$31)","v":""},{"$f":"IF(ISBLANK('FY25-26 Work Plan'!$B$32:$B$32),\"\",'FY25-26 Work Plan'!$B$32:$B$32)","v":""},{"$f":"IF(ISBLANK('FY25-26 Work Plan'!$E$32:$E$32),\"\",'FY25-26 Work Plan'!$E$32:$E$32)","v":""},{"$f":"IF(ISBLANK('FY25-26 Work Plan'!$I$32:$I$32),\"\",'FY25-26 Work Plan'!$I$32:$I$32)","v":""},{"$f":"IF(ISBLANK('FY25-26 Work Plan'!#REF!),\"\",'FY25-26 Work Plan'!#REF!)","v":{"$error":"#REF!"}},{"$f":"IF(ISBLANK('FY25-26 Work Plan'!#REF!),\"\",'FY25-26 Work Plan'!#REF!)","v":{"$error":"#REF!"}},{"$f":"IF(ISBLANK('FY25-26 Work Plan'!#REF!),\"\",'FY25-26 Work Plan'!#REF!)","v":{"$error":"#REF!"}},{"$f":"IF(ISBLANK('FY25-26 Work Plan'!#REF!),\"\",'FY25-26 Work Plan'!#REF!)","v":{"$error":"#REF!"}},{"$f":"IF(ISBLANK('FY25-26 Work Plan'!#REF!),\"\",'FY25-26 Work Plan'!#REF!)","v":{"$error":"#REF!"}},{"$f":"IF(ISBLANK('FY25-26 Work Plan'!#REF!),\"\",'FY25-26 Work Plan'!#REF!)","v":{"$error":"#REF!"}},{"$f":"IF(ISBLANK('FY25-26 Work Plan'!#REF!),\"\",'FY25-26 Work Plan'!#REF!)","v":{"$error":"#REF!"}},{"$f":"IF(ISBLANK('FY25-26 Work Plan'!#REF!),\"\",'FY25-26 Work Plan'!#REF!)","v":{"$error":"#REF!"}},{"$f":"IF(ISBLANK('FY25-26 Work Plan'!#REF!),\"\",'FY25-26 Work Plan'!#REF!)","v":{"$error":"#REF!"}}]
[{"$f":"IF(ISBLANK('FY25-26 Work Plan'!$E$2:$E$2),\"\",'FY25-26 Work Plan'!$E$2:$E$2)","v":"Asian American Drug Abuse Programs, Inc. (AADAP)"},{"$f":"IF(ISBLANK('FY25-26 Work Plan'!$L$2:$L$2),\"\",'FY25-26 Work Plan'!$L$2:$L$2)","v":"Prevention Education Program (PEP)"},{"$f":"IF(ISBLANK('FY25-26 Work Plan'!$L$3:$L$3),\"\",'FY25-26 Work Plan'!$L$3:$L$3)","v":""},{"$f":"IF(ISBLANK('FY25-26 Work Plan'!$E$3:$E$3),\"\",'FY25-26 Work Plan'!$E$3:$E$3)","v":"PH-005150 "},{"$f":"IF(ISBLANK('FY25-26 Work Plan'!$E$4:$E$4),\"\",TEXT('FY25-26 Work Plan'!$E$4:$E$4,\"000000\"))","v":"000001"},{"$f":"IF(ISBLANK('FY25-26 Work Plan'!$L$4:$L$4),\"\",'FY25-26 Work Plan'!$L$4:$L$4)","v":""},{"$f":"IF(ISBLANK('FY25-26 Work Plan'!$E$5:$E$5),\"\",'FY25-26 Work Plan'!$E$5:$E$5)","v":"2 - San Fernando Valley"},{"$f":"IF(ISBLANK('FY25-26 Work Plan'!$L$5:$L$5),\"\",'FY25-26 Work Plan'!$L$5:$L$5)","v":""},{"$f":"IF(ISBLANK('FY25-26 Work Plan'!$E$6:$E$6),\"\",'FY25-26 Work Plan'!$E$6:$E$6)","v":"Agoura Hills, Agua Dulce*"},{"$f":"IF(ISBLANK('FY25-26 Work Plan'!$F$7:$F$7),\"\",'FY25-26 Work Plan'!$F$7:$F$7)","v":""},{"$f":"IF(ISBLANK('FY25-26 Work Plan'!$F$8:$F$8),\"\",'FY25-26 Work Plan'!$F$8:$F$8)","v":""},{"$f":"IF(ISBLANK('FY25-26 Work Plan'!$E$9:$E$9),\"\",'FY25-26 Work Plan'!$E$9:$E$9)","v":"123 E Main St., Suite 100 \nAnytown, CA 90000"},{"$f":"IF(ISBLANK('FY25-26 Work Plan'!$L$9:$L$9),\"\",TEXT('FY25-26 Work Plan'!$L$9:$L$9,\"###-###-####\"))","v":"999-999-9999"},{"$f":"IF(ISBLANK('FY25-26 Work Plan'!$L$10:$L$10),\"\",'FY25-26 Work Plan'!$L$10:$L$10)","v":"www.abc1.org"},{"$f":"IF(ISBLANK('FY25-26 Work Plan'!$E$11:$E$11),\"\",'FY25-26 Work Plan'!$E$11:$E$11)","v":"123 E Main St., Suite 100 \nAnytown, CA 90000"},{"$f":"IF(ISBLANK('FY25-26 Work Plan'!$L$11:$L$11),\"\",TEXT('FY25-26 Work Plan'!$L$11:$L$11,\"###-###-####\"))","v":"999-999-9999"},{"$f":"IF(ISBLANK('FY25-26 Work Plan'!$L$12:$L$12),\"\",'FY25-26 Work Plan'!$L$12:$L$12)","v":"www.abc2.org"},{"$f":"IF(ISBLANK('FY25-26 Work Plan'!$E$15:$E$15),\"\",'FY25-26 Work Plan'!$E$15:$E$15)","v":"John/Jane Doe"},{"$f":"IF(ISBLANK('FY25-26 Work Plan'!$I$15:$I$15),\"\",TEXT('FY25-26 Work Plan'!$I$15:$I$15,\"###-###-####\"))","v":"213-555-1212"},{"$f":"IF(ISBLANK('FY25-26 Work Plan'!$L$15:$L$15),\"\",'FY25-26 Work Plan'!$L$15:$L$15)","v":"janedoe@preventionusa.com"},{"$f":"IF(ISBLANK('FY25-26 Work Plan'!$E$16:$E$16),\"\",'FY25-26 Work Plan'!$E$16:$E$16)","v":"John/Jane Doe"},{"$f":"IF(ISBLANK('FY25-26 Work Plan'!$I$16:$I$16),\"\",TEXT('FY25-26 Work Plan'!$I$16:$I$16,\"###-###-####\"))","v":"213-555-1212"},{"$f":"IF(ISBLANK('FY25-26 Work Plan'!$L$16:$L$16),\"\",'FY25-26 Work Plan'!$L$16:$L$16)","v":"janedoe@preventionusa.com"},{"$f":"IF(ISBLANK('FY25-26 Work Plan'!$E$17:$E$17),\"\",'FY25-26 Work Plan'!$E$17:$E$17)","v":"John/Jane Doe"},{"$f":"IF(ISBLANK('FY25-26 Work Plan'!$I$17:$I$17),\"\",TEXT('FY25-26 Work Plan'!$I$17:$I$17,\"###-###-####\"))","v":"213-555-1212"},{"$f":"IF(ISBLANK('FY25-26 Work Plan'!$L$17:$L$17),\"\",'FY25-26 Work Plan'!$L$17:$L$17)","v":"j.doe@preventionusa.com"},{"$f":"IF(ISBLANK('FY25-26 Work Plan'!$E$18:$E$18),\"\",'FY25-26 Work Plan'!$E$18:$E$18)","v":"John/Jane Doe"},{"$f":"IF(ISBLANK('FY25-26 Work Plan'!$I$18:$I$18),\"\",TEXT('FY25-26 Work Plan'!$I$18:$I$18,\"###-###-####\"))","v":"213-555-1213"},{"$f":"IF(ISBLANK('FY25-26 Work Plan'!$L$18:$L$18),\"\",'FY25-26 Work Plan'!$L$18:$L$18)","v":"j.doe@preventionusa.com"},{"$f":"IF(ISBLANK('FY25-26 Work Plan'!$E$19:$E$19),\"\",'FY25-26 Work Plan'!$E$19:$E$19)","v":"John/Jane Doe"},{"$f":"IF(ISBLANK('FY25-26 Work Plan'!$I$19:$I$19),\"\",TEXT('FY25-26 Work Plan'!$I$19:$I$19,\"###-###-####\"))","v":"213-555-1213"},{"$f":"IF(ISBLANK('FY25-26 Work Plan'!$L$19:$L$19),\"\",'FY25-26 Work Plan'!$L$19:$L$19)","v":"j.doe@preventionusa.com"},{"$f":"IF(ISBLANK('FY25-26 Work Plan'!$E$23:$E$23),\"\",'FY25-26 Work Plan'!$E$23:$E$23)","v":""},{"$f":"IF(ISBLANK('FY25-26 Work Plan'!$I$23:$I$23),\"\",'FY25-26 Work Plan'!$I$23:$I$23)","v":""},{"$f":"IF(ISBLANK('FY25-26 Work Plan'!$E$24:$E$24),\"\",'FY25-26 Work Plan'!$E$24:$E$24)","v":""},{"$f":"IF(ISBLANK('FY25-26 Work Plan'!$I$24:$I$24),\"\",'FY25-26 Work Plan'!$I$24:$I$24)","v":""},{"$f":"IF(ISBLANK('FY25-26 Work Plan'!$E$25:$E$25),\"\",'FY25-26 Work Plan'!$E$25:$E$25)","v":""},{"$f":"IF(ISBLANK('FY25-26 Work Plan'!$I$25:$I$25),\"\",'FY25-26 Work Plan'!$I$25:$I$25)","v":""},{"$f":"IF(ISBLANK('FY25-26 Work Plan'!$E$26:$E$26),\"\",'FY25-26 Work Plan'!$E$26:$E$26)","v":""},{"$f":"IF(ISBLANK('FY25-26 Work Plan'!$I$26:$I$26),\"\",'FY25-26 Work Plan'!$I$26:$I$26)","v":""},{"$f":"IF(ISBLANK('FY25-26 Work Plan'!$E$27:$E$27),\"\",'FY25-26 Work Plan'!$E$27:$E$27)","v":""},{"$f":"IF(ISBLANK('FY25-26 Work Plan'!$I$27:$I$27),\"\",'FY25-26 Work Plan'!$I$27:$I$27)","v":""},{"$f":"IF(ISBLANK('FY25-26 Work Plan'!$E$28:$E$28),\"\",'FY25-26 Work Plan'!$E$28:$E$28)","v":""},{"$f":"IF(ISBLANK('FY25-26 Work Plan'!$I$28:$I$28),\"\",'FY25-26 Work Plan'!$I$28:$I$28)","v":""},{"$f":"IF(ISBLANK('FY25-26 Work Plan'!$E$29:$E$29),\"\",'FY25-26 Work Plan'!$E$29:$E$29)","v":""},{"$f":"IF(ISBLANK('FY25-26 Work Plan'!$I$29:$I$29),\"\",'FY25-26 Work Plan'!$I$29:$I$29)","v":""},{"$f":"IF(ISBLANK('FY25-26 Work Plan'!$B$30:$B$30),\"\",'FY25-26 Work Plan'!$B$30:$B$30)","v":""},{"$f":"IF(ISBLANK('FY25-26 Work Plan'!$E$30:$E$30),\"\",'FY25-26 Work Plan'!$E$30:$E$30)","v":""},{"$f":"IF(ISBLANK('FY25-26 Work Plan'!$I$30:$I$30),\"\",'FY25-26 Work Plan'!$I$30:$I$30)","v":""},{"$f":"IF(ISBLANK('FY25-26 Work Plan'!$B$31:$B$31),\"\",'FY25-26 Work Plan'!$B$31:$B$31)","v":""},{"$f":"IF(ISBLANK('FY25-26 Work Plan'!$E$31:$E$31),\"\",'FY25-26 Work Plan'!$E$31:$E$31)","v":""},{"$f":"IF(ISBLANK('FY25-26 Work Plan'!$I$31:$I$31),\"\",'FY25-26 Work Plan'!$I$31:$I$31)","v":""},{"$f":"IF(ISBLANK('FY25-26 Work Plan'!$B$32:$B$32),\"\",'FY25-26 Work Plan'!$B$32:$B$32)","v":""},{"$f":"IF(ISBLANK('FY25-26 Work Plan'!$E$32:$E$32),\"\",'FY25-26 Work Plan'!$E$32:$E$32)","v":""},{"$f":"IF(ISBLANK('FY25-26 Work Plan'!$I$32:$I$32),\"\",'FY25-26 Work Plan'!$I$32:$I$32)","v":""},{"$f":"IF(ISBLANK('FY25-26 Work Plan'!#REF!),\"\",'FY25-26 Work Plan'!#REF!)","v":{"$error":"#REF!"}},{"$f":"IF(ISBLANK('FY25-26 Work Plan'!#REF!),\"\",'FY25-26 Work Plan'!#REF!)","v":{"$error":"#REF!"}},{"$f":"IF(ISBLANK('FY25-26 Work Plan'!#REF!),\"\",'FY25-26 Work Plan'!#REF!)","v":{"$error":"#REF!"}},{"$f":"IF(ISBLANK('FY25-26 Work Plan'!#REF!),\"\",'FY25-26 Work Plan'!#REF!)","v":{"$error":"#REF!"}},{"$f":"IF(ISBLANK('FY25-26 Work Plan'!#REF!),\"\",'FY25-26 Work Plan'!#REF!)","v":{"$error":"#REF!"}},{"$f":"IF(ISBLANK('FY25-26 Work Plan'!#REF!),\"\",'FY25-26 Work Plan'!#REF!)","v":{"$error":"#REF!"}},{"$f":"IF(ISBLANK('FY25-26 Work Plan'!#REF!),\"\",'FY25-26 Work Plan'!#REF!)","v":{"$error":"#REF!"}},{"$f":"IF(ISBLANK('FY25-26 Work Plan'!#REF!),\"\",'FY25-26 Work Plan'!#REF!)","v":{"$error":"#REF!"}},{"$f":"IF(ISBLANK('FY25-26 Work Plan'!#REF!),\"\",'FY25-26 Work Plan'!#REF!)","v":{"$error":"#REF!"}}]
[{"$f":"IF(ISBLANK('FY25-26 Work Plan'!$E$2:$E$2),\"\",'FY25-26 Work Plan'!$E$2:$E$2)","v":"Asian American Drug Abuse Programs, Inc. (AADAP)"},{"$f":"IF(ISBLANK('FY25-26 Work Plan'!$L$2:$L$2),\"\",'FY25-26 Work Plan'!$L$2:$L$2)","v":"Prevention Education Program (PEP)"},{"$f":"IF(ISBLANK('FY25-26 Work Plan'!$L$3:$L$3),\"\",'FY25-26 Work Plan'!$L$3:$L$3)","v":""},{"$f":"IF(ISBLANK('FY25-26 Work Plan'!$E$3:$E$3),\"\",'FY25-26 Work Plan'!$E$3:$E$3)","v":"PH-005150 "},{"$f":"IF(ISBLANK('FY25-26 Work Plan'!$E$4:$E$4),\"\",TEXT('FY25-26 Work Plan'!$E$4:$E$4,\"000000\"))","v":"000001"},{"$f":"IF(ISBLANK('FY25-26 Work Plan'!$L$4:$L$4),\"\",'FY25-26 Work Plan'!$L$4:$L$4)","v":""},{"$f":"IF(ISBLANK('FY25-26 Work Plan'!$E$5:$E$5),\"\",'FY25-26 Work Plan'!$E$5:$E$5)","v":"2 - San Fernando Valley"},{"$f":"IF(ISBLANK('FY25-26 Work Plan'!$L$5:$L$5),\"\",'FY25-26 Work Plan'!$L$5:$L$5)","v":""},{"$f":"IF(ISBLANK('FY25-26 Work Plan'!$E$6:$E$6),\"\",'FY25-26 Work Plan'!$E$6:$E$6)","v":"Agoura Hills, Agua Dulce*"},{"$f":"IF(ISBLANK('FY25-26 Work Plan'!$F$7:$F$7),\"\",'FY25-26 Work Plan'!$F$7:$F$7)","v":""},{"$f":"IF(ISBLANK('FY25-26 Work Plan'!$F$8:$F$8),\"\",'FY25-26 Work Plan'!$F$8:$F$8)","v":""},{"$f":"IF(ISBLANK('FY25-26 Work Plan'!$E$9:$E$9),\"\",'FY25-26 Work Plan'!$E$9:$E$9)","v":"123 E Main St., Suite 100 \nAnytown, CA 90000"},{"$f":"IF(ISBLANK('FY25-26 Work Plan'!$L$9:$L$9),\"\",TEXT('FY25-26 Work Plan'!$L$9:$L$9,\"###-###-####\"))","v":"999-999-9999"},{"$f":"IF(ISBLANK('FY25-26 Work Plan'!$L$10:$L$10),\"\",'FY25-26 Work Plan'!$L$10:$L$10)","v":"www.abc1.org"},{"$f":"IF(ISBLANK('FY25-26 Work Plan'!$E$11:$E$11),\"\",'FY25-26 Work Plan'!$E$11:$E$11)","v":"123 E Main St., Suite 100 \nAnytown, CA 90000"},{"$f":"IF(ISBLANK('FY25-26 Work Plan'!$L$11:$L$11),\"\",TEXT('FY25-26 Work Plan'!$L$11:$L$11,\"###-###-####\"))","v":"999-999-9999"},{"$f":"IF(ISBLANK('FY25-26 Work Plan'!$L$12:$L$12),\"\",'FY25-26 Work Plan'!$L$12:$L$12)","v":"www.abc2.org"},{"$f":"IF(ISBLANK('FY25-26 Work Plan'!$E$15:$E$15),\"\",'FY25-26 Work Plan'!$E$15:$E$15)","v":"John/Jane Doe"},{"$f":"IF(ISBLANK('FY25-26 Work Plan'!$I$15:$I$15),\"\",TEXT('FY25-26 Work Plan'!$I$15:$I$15,\"###-###-####\"))","v":"213-555-1212"},{"$f":"IF(ISBLANK('FY25-26 Work Plan'!$L$15:$L$15),\"\",'FY25-26 Work Plan'!$L$15:$L$15)","v":"janedoe@preventionusa.com"},{"$f":"IF(ISBLANK('FY25-26 Work Plan'!$E$16:$E$16),\"\",'FY25-26 Work Plan'!$E$16:$E$16)","v":"John/Jane Doe"},{"$f":"IF(ISBLANK('FY25-26 Work Plan'!$I$16:$I$16),\"\",TEXT('FY25-26 Work Plan'!$I$16:$I$16,\"###-###-####\"))","v":"213-555-1212"},{"$f":"IF(ISBLANK('FY25-26 Work Plan'!$L$16:$L$16),\"\",'FY25-26 Work Plan'!$L$16:$L$16)","v":"janedoe@preventionusa.com"},{"$f":"IF(ISBLANK('FY25-26 Work Plan'!$E$17:$E$17),\"\",'FY25-26 Work Plan'!$E$17:$E$17)","v":"John/Jane Doe"},{"$f":"IF(ISBLANK('FY25-26 Work Plan'!$I$17:$I$17),\"\",TEXT('FY25-26 Work Plan'!$I$17:$I$17,\"###-###-####\"))","v":"213-555-1212"},{"$f":"IF(ISBLANK('FY25-26 Work Plan'!$L$17:$L$17),\"\",'FY25-26 Work Plan'!$L$17:$L$17)","v":"j.doe@preventionusa.com"},{"$f":"IF(ISBLANK('FY25-26 Work Plan'!$E$18:$E$18),\"\",'FY25-26 Work Plan'!$E$18:$E$18)","v":"John/Jane Doe"},{"$f":"IF(ISBLANK('FY25-26 Work Plan'!$I$18:$I$18),\"\",TEXT('FY25-26 Work Plan'!$I$18:$I$18,\"###-###-####\"))","v":"213-555-1213"},{"$f":"IF(ISBLANK('FY25-26 Work Plan'!$L$18:$L$18),\"\",'FY25-26 Work Plan'!$L$18:$L$18)","v":"j.doe@preventionusa.com"},{"$f":"IF(ISBLANK('FY25-26 Work Plan'!$E$19:$E$19),\"\",'FY25-26 Work Plan'!$E$19:$E$19)","v":"John/Jane Doe"},{"$f":"IF(ISBLANK('FY25-26 Work Plan'!$I$19:$I$19),\"\",TEXT('FY25-26 Work Plan'!$I$19:$I$19,\"###-###-####\"))","v":"213-555-1213"},{"$f":"IF(ISBLANK('FY25-26 Work Plan'!$L$19:$L$19),\"\",'FY25-26 Work Plan'!$L$19:$L$19)","v":"j.doe@preventionusa.com"},{"$f":"IF(ISBLANK('FY25-26 Work Plan'!$E$23:$E$23),\"\",'FY25-26 Work Plan'!$E$23:$E$23)","v":""},{"$f":"IF(ISBLANK('FY25-26 Work Plan'!$I$23:$I$23),\"\",'FY25-26 Work Plan'!$I$23:$I$23)","v":""},{"$f":"IF(ISBLANK('FY25-26 Work Plan'!$E$24:$E$24),\"\",'FY25-26 Work Plan'!$E$24:$E$24)","v":""},{"$f":"IF(ISBLANK('FY25-26 Work Plan'!$I$24:$I$24),\"\",'FY25-26 Work Plan'!$I$24:$I$24)","v":""},{"$f":"IF(ISBLANK('FY25-26 Work Plan'!$E$25:$E$25),\"\",'FY25-26 Work Plan'!$E$25:$E$25)","v":""},{"$f":"IF(ISBLANK('FY25-26 Work Plan'!$I$25:$I$25),\"\",'FY25-26 Work Plan'!$I$25:$I$25)","v":""},{"$f":"IF(ISBLANK('FY25-26 Work Plan'!$E$26:$E$26),\"\",'FY25-26 Work Plan'!$E$26:$E$26)","v":""},{"$f":"IF(ISBLANK('FY25-26 Work Plan'!$I$26:$I$26),\"\",'FY25-26 Work Plan'!$I$26:$I$26)","v":""},{"$f":"IF(ISBLANK('FY25-26 Work Plan'!$E$27:$E$27),\"\",'FY25-26 Work Plan'!$E$27:$E$27)","v":""},{"$f":"IF(ISBLANK('FY25-26 Work Plan'!$I$27:$I$27),\"\",'FY25-26 Work Plan'!$I$27:$I$27)","v":""},{"$f":"IF(ISBLANK('FY25-26 Work Plan'!$E$28:$E$28),\"\",'FY25-26 Work Plan'!$E$28:$E$28)","v":""},{"$f":"IF(ISBLANK('FY25-26 Work Plan'!$I$28:$I$28),\"\",'FY25-26 Work Plan'!$I$28:$I$28)","v":""},{"$f":"IF(ISBLANK('FY25-26 Work Plan'!$E$29:$E$29),\"\",'FY25-26 Work Plan'!$E$29:$E$29)","v":""},{"$f":"IF(ISBLANK('FY25-26 Work Plan'!$I$29:$I$29),\"\",'FY25-26 Work Plan'!$I$29:$I$29)","v":""},{"$f":"IF(ISBLANK('FY25-26 Work Plan'!$B$30:$B$30),\"\",'FY25-26 Work Plan'!$B$30:$B$30)","v":""},{"$f":"IF(ISBLANK('FY25-26 Work Plan'!$E$30:$E$30),\"\",'FY25-26 Work Plan'!$E$30:$E$30)","v":""},{"$f":"IF(ISBLANK('FY25-26 Work Plan'!$I$30:$I$30),\"\",'FY25-26 Work Plan'!$I$30:$I$30)","v":""},{"$f":"IF(ISBLANK('FY25-26 Work Plan'!$B$31:$B$31),\"\",'FY25-26 Work Plan'!$B$31:$B$31)","v":""},{"$f":"IF(ISBLANK('FY25-26 Work Plan'!$E$31:$E$31),\"\",'FY25-26 Work Plan'!$E$31:$E$31)","v":""},{"$f":"IF(ISBLANK('FY25-26 Work Plan'!$I$31:$I$31),\"\",'FY25-26 Work Plan'!$I$31:$I$31)","v":""},{"$f":"IF(ISBLANK('FY25-26 Work Plan'!$B$32:$B$32),\"\",'FY25-26 Work Plan'!$B$32:$B$32)","v":""},{"$f":"IF(ISBLANK('FY25-26 Work Plan'!$E$32:$E$32),\"\",'FY25-26 Work Plan'!$E$32:$E$32)","v":""},{"$f":"IF(ISBLANK('FY25-26 Work Plan'!$I$32:$I$32),\"\",'FY25-26 Work Plan'!$I$32:$I$32)","v":""},{"$f":"IF(ISBLANK('FY25-26 Work Plan'!#REF!),\"\",'FY25-26 Work Plan'!#REF!)","v":{"$error":"#REF!"}},{"$f":"IF(ISBLANK('FY25-26 Work Plan'!#REF!),\"\",'FY25-26 Work Plan'!#REF!)","v":{"$error":"#REF!"}},{"$f":"IF(ISBLANK('FY25-26 Work Plan'!#REF!),\"\",'FY25-26 Work Plan'!#REF!)","v":{"$error":"#REF!"}},{"$f":"IF(ISBLANK('FY25-26 Work Plan'!#REF!),\"\",'FY25-26 Work Plan'!#REF!)","v":{"$error":"#REF!"}},{"$f":"IF(ISBLANK('FY25-26 Work Plan'!#REF!),\"\",'FY25-26 Work Plan'!#REF!)","v":{"$error":"#REF!"}},{"$f":"IF(ISBLANK('FY25-26 Work Plan'!#REF!),\"\",'FY25-26 Work Plan'!#REF!)","v":{"$error":"#REF!"}},{"$f":"IF(ISBLANK('FY25-26 Work Plan'!#REF!),\"\",'FY25-26 Work Plan'!#REF!)","v":{"$error":"#REF!"}},{"$f":"IF(ISBLANK('FY25-26 Work Plan'!#REF!),\"\",'FY25-26 Work Plan'!#REF!)","v":{"$error":"#REF!"}},{"$f":"IF(ISBLANK('FY25-26 Work Plan'!#REF!),\"\",'FY25-26 Work Plan'!#REF!)","v":{"$error":"#REF!"}}]
[{"$f":"IF(ISBLANK('FY25-26 Work Plan'!$E$2:$E$2),\"\",'FY25-26 Work Plan'!$E$2:$E$2)","v":"Asian American Drug Abuse Programs, Inc. (AADAP)"},{"$f":"IF(ISBLANK('FY25-26 Work Plan'!$L$2:$L$2),\"\",'FY25-26 Work Plan'!$L$2:$L$2)","v":"Prevention Education Program (PEP)"},{"$f":"IF(ISBLANK('FY25-26 Work Plan'!$L$3:$L$3),\"\",'FY25-26 Work Plan'!$L$3:$L$3)","v":""},{"$f":"IF(ISBLANK('FY25-26 Work Plan'!$E$3:$E$3),\"\",'FY25-26 Work Plan'!$E$3:$E$3)","v":"PH-005150 "},{"$f":"IF(ISBLANK('FY25-26 Work Plan'!$E$4:$E$4),\"\",TEXT('FY25-26 Work Plan'!$E$4:$E$4,\"000000\"))","v":"000001"},{"$f":"IF(ISBLANK('FY25-26 Work Plan'!$L$4:$L$4),\"\",'FY25-26 Work Plan'!$L$4:$L$4)","v":""},{"$f":"IF(ISBLANK('FY25-26 Work Plan'!$E$5:$E$5),\"\",'FY25-26 Work Plan'!$E$5:$E$5)","v":"2 - San Fernando Valley"},{"$f":"IF(ISBLANK('FY25-26 Work Plan'!$L$5:$L$5),\"\",'FY25-26 Work Plan'!$L$5:$L$5)","v":""},{"$f":"IF(ISBLANK('FY25-26 Work Plan'!$E$6:$E$6),\"\",'FY25-26 Work Plan'!$E$6:$E$6)","v":"Agoura Hills, Agua Dulce*"},{"$f":"IF(ISBLANK('FY25-26 Work Plan'!$F$7:$F$7),\"\",'FY25-26 Work Plan'!$F$7:$F$7)","v":""},{"$f":"IF(ISBLANK('FY25-26 Work Plan'!$F$8:$F$8),\"\",'FY25-26 Work Plan'!$F$8:$F$8)","v":""},{"$f":"IF(ISBLANK('FY25-26 Work Plan'!$E$9:$E$9),\"\",'FY25-26 Work Plan'!$E$9:$E$9)","v":"123 E Main St., Suite 100 \nAnytown, CA 90000"},{"$f":"IF(ISBLANK('FY25-26 Work Plan'!$L$9:$L$9),\"\",TEXT('FY25-26 Work Plan'!$L$9:$L$9,\"###-###-####\"))","v":"999-999-9999"},{"$f":"IF(ISBLANK('FY25-26 Work Plan'!$L$10:$L$10),\"\",'FY25-26 Work Plan'!$L$10:$L$10)","v":"www.abc1.org"},{"$f":"IF(ISBLANK('FY25-26 Work Plan'!$E$11:$E$11),\"\",'FY25-26 Work Plan'!$E$11:$E$11)","v":"123 E Main St., Suite 100 \nAnytown, CA 90000"},{"$f":"IF(ISBLANK('FY25-26 Work Plan'!$L$11:$L$11),\"\",TEXT('FY25-26 Work Plan'!$L$11:$L$11,\"###-###-####\"))","v":"999-999-9999"},{"$f":"IF(ISBLANK('FY25-26 Work Plan'!$L$12:$L$12),\"\",'FY25-26 Work Plan'!$L$12:$L$12)","v":"www.abc2.org"},{"$f":"IF(ISBLANK('FY25-26 Work Plan'!$E$15:$E$15),\"\",'FY25-26 Work Plan'!$E$15:$E$15)","v":"John/Jane Doe"},{"$f":"IF(ISBLANK('FY25-26 Work Plan'!$I$15:$I$15),\"\",TEXT('FY25-26 Work Plan'!$I$15:$I$15,\"###-###-####\"))","v":"213-555-1212"},{"$f":"IF(ISBLANK('FY25-26 Work Plan'!$L$15:$L$15),\"\",'FY25-26 Work Plan'!$L$15:$L$15)","v":"janedoe@preventionusa.com"},{"$f":"IF(ISBLANK('FY25-26 Work Plan'!$E$16:$E$16),\"\",'FY25-26 Work Plan'!$E$16:$E$16)","v":"John/Jane Doe"},{"$f":"IF(ISBLANK('FY25-26 Work Plan'!$I$16:$I$16),\"\",TEXT('FY25-26 Work Plan'!$I$16:$I$16,\"###-###-####\"))","v":"213-555-1212"},{"$f":"IF(ISBLANK('FY25-26 Work Plan'!$L$16:$L$16),\"\",'FY25-26 Work Plan'!$L$16:$L$16)","v":"janedoe@preventionusa.com"},{"$f":"IF(ISBLANK('FY25-26 Work Plan'!$E$17:$E$17),\"\",'FY25-26 Work Plan'!$E$17:$E$17)","v":"John/Jane Doe"},{"$f":"IF(ISBLANK('FY25-26 Work Plan'!$I$17:$I$17),\"\",TEXT('FY25-26 Work Plan'!$I$17:$I$17,\"###-###-####\"))","v":"213-555-1212"},{"$f":"IF(ISBLANK('FY25-26 Work Plan'!$L$17:$L$17),\"\",'FY25-26 Work Plan'!$L$17:$L$17)","v":"j.doe@preventionusa.com"},{"$f":"IF(ISBLANK('FY25-26 Work Plan'!$E$18:$E$18),\"\",'FY25-26 Work Plan'!$E$18:$E$18)","v":"John/Jane Doe"},{"$f":"IF(ISBLANK('FY25-26 Work Plan'!$I$18:$I$18),\"\",TEXT('FY25-26 Work Plan'!$I$18:$I$18,\"###-###-####\"))","v":"213-555-1213"},{"$f":"IF(ISBLANK('FY25-26 Work Plan'!$L$18:$L$18),\"\",'FY25-26 Work Plan'!$L$18:$L$18)","v":"j.doe@preventionusa.com"},{"$f":"IF(ISBLANK('FY25-26 Work Plan'!$E$19:$E$19),\"\",'FY25-26 Work Plan'!$E$19:$E$19)","v":"John/Jane Doe"},{"$f":"IF(ISBLANK('FY25-26 Work Plan'!$I$19:$I$19),\"\",TEXT('FY25-26 Work Plan'!$I$19:$I$19,\"###-###-####\"))","v":"213-555-1213"},{"$f":"IF(ISBLANK('FY25-26 Work Plan'!$L$19:$L$19),\"\",'FY25-26 Work Plan'!$L$19:$L$19)","v":"j.doe@preventionusa.com"},{"$f":"IF(ISBLANK('FY25-26 Work Plan'!$E$23:$E$23),\"\",'FY25-26 Work Plan'!$E$23:$E$23)","v":""},{"$f":"IF(ISBLANK('FY25-26 Work Plan'!$I$23:$I$23),\"\",'FY25-26 Work Plan'!$I$23:$I$23)","v":""},{"$f":"IF(ISBLANK('FY25-26 Work Plan'!$E$24:$E$24),\"\",'FY25-26 Work Plan'!$E$24:$E$24)","v":""},{"$f":"IF(ISBLANK('FY25-26 Work Plan'!$I$24:$I$24),\"\",'FY25-26 Work Plan'!$I$24:$I$24)","v":""},{"$f":"IF(ISBLANK('FY25-26 Work Plan'!$E$25:$E$25),\"\",'FY25-26 Work Plan'!$E$25:$E$25)","v":""},{"$f":"IF(ISBLANK('FY25-26 Work Plan'!$I$25:$I$25),\"\",'FY25-26 Work Plan'!$I$25:$I$25)","v":""},{"$f":"IF(ISBLANK('FY25-26 Work Plan'!$E$26:$E$26),\"\",'FY25-26 Work Plan'!$E$26:$E$26)","v":""},{"$f":"IF(ISBLANK('FY25-26 Work Plan'!$I$26:$I$26),\"\",'FY25-26 Work Plan'!$I$26:$I$26)","v":""},{"$f":"IF(ISBLANK('FY25-26 Work Plan'!$E$27:$E$27),\"\",'FY25-26 Work Plan'!$E$27:$E$27)","v":""},{"$f":"IF(ISBLANK('FY25-26 Work Plan'!$I$27:$I$27),\"\",'FY25-26 Work Plan'!$I$27:$I$27)","v":""},{"$f":"IF(ISBLANK('FY25-26 Work Plan'!$E$28:$E$28),\"\",'FY25-26 Work Plan'!$E$28:$E$28)","v":""},{"$f":"IF(ISBLANK('FY25-26 Work Plan'!$I$28:$I$28),\"\",'FY25-26 Work Plan'!$I$28:$I$28)","v":""},{"$f":"IF(ISBLANK('FY25-26 Work Plan'!$E$29:$E$29),\"\",'FY25-26 Work Plan'!$E$29:$E$29)","v":""},{"$f":"IF(ISBLANK('FY25-26 Work Plan'!$I$29:$I$29),\"\",'FY25-26 Work Plan'!$I$29:$I$29)","v":""},{"$f":"IF(ISBLANK('FY25-26 Work Plan'!$B$30:$B$30),\"\",'FY25-26 Work Plan'!$B$30:$B$30)","v":""},{"$f":"IF(ISBLANK('FY25-26 Work Plan'!$E$30:$E$30),\"\",'FY25-26 Work Plan'!$E$30:$E$30)","v":""},{"$f":"IF(ISBLANK('FY25-26 Work Plan'!$I$30:$I$30),\"\",'FY25-26 Work Plan'!$I$30:$I$30)","v":""},{"$f":"IF(ISBLANK('FY25-26 Work Plan'!$B$31:$B$31),\"\",'FY25-26 Work Plan'!$B$31:$B$31)","v":""},{"$f":"IF(ISBLANK('FY25-26 Work Plan'!$E$31:$E$31),\"\",'FY25-26 Work Plan'!$E$31:$E$31)","v":""},{"$f":"IF(ISBLANK('FY25-26 Work Plan'!$I$31:$I$31),\"\",'FY25-26 Work Plan'!$I$31:$I$31)","v":""},{"$f":"IF(ISBLANK('FY25-26 Work Plan'!$B$32:$B$32),\"\",'FY25-26 Work Plan'!$B$32:$B$32)","v":""},{"$f":"IF(ISBLANK('FY25-26 Work Plan'!$E$32:$E$32),\"\",'FY25-26 Work Plan'!$E$32:$E$32)","v":""},{"$f":"IF(ISBLANK('FY25-26 Work Plan'!$I$32:$I$32),\"\",'FY25-26 Work Plan'!$I$32:$I$32)","v":""},{"$f":"IF(ISBLANK('FY25-26 Work Plan'!#REF!),\"\",'FY25-26 Work Plan'!#REF!)","v":{"$error":"#REF!"}},{"$f":"IF(ISBLANK('FY25-26 Work Plan'!#REF!),\"\",'FY25-26 Work Plan'!#REF!)","v":{"$error":"#REF!"}},{"$f":"IF(ISBLANK('FY25-26 Work Plan'!#REF!),\"\",'FY25-26 Work Plan'!#REF!)","v":{"$error":"#REF!"}},{"$f":"IF(ISBLANK('FY25-26 Work Plan'!#REF!),\"\",'FY25-26 Work Plan'!#REF!)","v":{"$error":"#REF!"}},{"$f":"IF(ISBLANK('FY25-26 Work Plan'!#REF!),\"\",'FY25-26 Work Plan'!#REF!)","v":{"$error":"#REF!"}},{"$f":"IF(ISBLANK('FY25-26 Work Plan'!#REF!),\"\",'FY25-26 Work Plan'!#REF!)","v":{"$error":"#REF!"}},{"$f":"IF(ISBLANK('FY25-26 Work Plan'!#REF!),\"\",'FY25-26 Work Plan'!#REF!)","v":{"$error":"#REF!"}},{"$f":"IF(ISBLANK('FY25-26 Work Plan'!#REF!),\"\",'FY25-26 Work Plan'!#REF!)","v":{"$error":"#REF!"}},{"$f":"IF(ISBLANK('FY25-26 Work Plan'!#REF!),\"\",'FY25-26 Work Plan'!#REF!)","v":{"$error":"#REF!"}}]
[{"$f":"IF(ISBLANK('FY25-26 Work Plan'!$E$2:$E$2),\"\",'FY25-26 Work Plan'!$E$2:$E$2)","v":"Asian American Drug Abuse Programs, Inc. (AADAP)"},{"$f":"IF(ISBLANK('FY25-26 Work Plan'!$L$2:$L$2),\"\",'FY25-26 Work Plan'!$L$2:$L$2)","v":"Prevention Education Program (PEP)"},{"$f":"IF(ISBLANK('FY25-26 Work Plan'!$L$3:$L$3),\"\",'FY25-26 Work Plan'!$L$3:$L$3)","v":""},{"$f":"IF(ISBLANK('FY25-26 Work Plan'!$E$3:$E$3),\"\",'FY25-26 Work Plan'!$E$3:$E$3)","v":"PH-005150 "},{"$f":"IF(ISBLANK('FY25-26 Work Plan'!$E$4:$E$4),\"\",TEXT('FY25-26 Work Plan'!$E$4:$E$4,\"000000\"))","v":"000001"},{"$f":"IF(ISBLANK('FY25-26 Work Plan'!$L$4:$L$4),\"\",'FY25-26 Work Plan'!$L$4:$L$4)","v":""},{"$f":"IF(ISBLANK('FY25-26 Work Plan'!$E$5:$E$5),\"\",'FY25-26 Work Plan'!$E$5:$E$5)","v":"2 - San Fernando Valley"},{"$f":"IF(ISBLANK('FY25-26 Work Plan'!$L$5:$L$5),\"\",'FY25-26 Work Plan'!$L$5:$L$5)","v":""},{"$f":"IF(ISBLANK('FY25-26 Work Plan'!$E$6:$E$6),\"\",'FY25-26 Work Plan'!$E$6:$E$6)","v":"Agoura Hills, Agua Dulce*"},{"$f":"IF(ISBLANK('FY25-26 Work Plan'!$F$7:$F$7),\"\",'FY25-26 Work Plan'!$F$7:$F$7)","v":""},{"$f":"IF(ISBLANK('FY25-26 Work Plan'!$F$8:$F$8),\"\",'FY25-26 Work Plan'!$F$8:$F$8)","v":""},{"$f":"IF(ISBLANK('FY25-26 Work Plan'!$E$9:$E$9),\"\",'FY25-26 Work Plan'!$E$9:$E$9)","v":"123 E Main St., Suite 100 \nAnytown, CA 90000"},{"$f":"IF(ISBLANK('FY25-26 Work Plan'!$L$9:$L$9),\"\",TEXT('FY25-26 Work Plan'!$L$9:$L$9,\"###-###-####\"))","v":"999-999-9999"},{"$f":"IF(ISBLANK('FY25-26 Work Plan'!$L$10:$L$10),\"\",'FY25-26 Work Plan'!$L$10:$L$10)","v":"www.abc1.org"},{"$f":"IF(ISBLANK('FY25-26 Work Plan'!$E$11:$E$11),\"\",'FY25-26 Work Plan'!$E$11:$E$11)","v":"123 E Main St., Suite 100 \nAnytown, CA 90000"},{"$f":"IF(ISBLANK('FY25-26 Work Plan'!$L$11:$L$11),\"\",TEXT('FY25-26 Work Plan'!$L$11:$L$11,\"###-###-####\"))","v":"999-999-9999"},{"$f":"IF(ISBLANK('FY25-26 Work Plan'!$L$12:$L$12),\"\",'FY25-26 Work Plan'!$L$12:$L$12)","v":"www.abc2.org"},{"$f":"IF(ISBLANK('FY25-26 Work Plan'!$E$15:$E$15),\"\",'FY25-26 Work Plan'!$E$15:$E$15)","v":"John/Jane Doe"},{"$f":"IF(ISBLANK('FY25-26 Work Plan'!$I$15:$I$15),\"\",TEXT('FY25-26 Work Plan'!$I$15:$I$15,\"###-###-####\"))","v":"213-555-1212"},{"$f":"IF(ISBLANK('FY25-26 Work Plan'!$L$15:$L$15),\"\",'FY25-26 Work Plan'!$L$15:$L$15)","v":"janedoe@preventionusa.com"},{"$f":"IF(ISBLANK('FY25-26 Work Plan'!$E$16:$E$16),\"\",'FY25-26 Work Plan'!$E$16:$E$16)","v":"John/Jane Doe"},{"$f":"IF(ISBLANK('FY25-26 Work Plan'!$I$16:$I$16),\"\",TEXT('FY25-26 Work Plan'!$I$16:$I$16,\"###-###-####\"))","v":"213-555-1212"},{"$f":"IF(ISBLANK('FY25-26 Work Plan'!$L$16:$L$16),\"\",'FY25-26 Work Plan'!$L$16:$L$16)","v":"janedoe@preventionusa.com"},{"$f":"IF(ISBLANK('FY25-26 Work Plan'!$E$17:$E$17),\"\",'FY25-26 Work Plan'!$E$17:$E$17)","v":"John/Jane Doe"},{"$f":"IF(ISBLANK('FY25-26 Work Plan'!$I$17:$I$17),\"\",TEXT('FY25-26 Work Plan'!$I$17:$I$17,\"###-###-####\"))","v":"213-555-1212"},{"$f":"IF(ISBLANK('FY25-26 Work Plan'!$L$17:$L$17),\"\",'FY25-26 Work Plan'!$L$17:$L$17)","v":"j.doe@preventionusa.com"},{"$f":"IF(ISBLANK('FY25-26 Work Plan'!$E$18:$E$18),\"\",'FY25-26 Work Plan'!$E$18:$E$18)","v":"John/Jane Doe"},{"$f":"IF(ISBLANK('FY25-26 Work Plan'!$I$18:$I$18),\"\",TEXT('FY25-26 Work Plan'!$I$18:$I$18,\"###-###-####\"))","v":"213-555-1213"},{"$f":"IF(ISBLANK('FY25-26 Work Plan'!$L$18:$L$18),\"\",'FY25-26 Work Plan'!$L$18:$L$18)","v":"j.doe@preventionusa.com"},{"$f":"IF(ISBLANK('FY25-26 Work Plan'!$E$19:$E$19),\"\",'FY25-26 Work Plan'!$E$19:$E$19)","v":"John/Jane Doe"},{"$f":"IF(ISBLANK('FY25-26 Work Plan'!$I$19:$I$19),\"\",TEXT('FY25-26 Work Plan'!$I$19:$I$19,\"###-###-####\"))","v":"213-555-1213"},{"$f":"IF(ISBLANK('FY25-26 Work Plan'!$L$19:$L$19),\"\",'FY25-26 Work Plan'!$L$19:$L$19)","v":"j.doe@preventionusa.com"},{"$f":"IF(ISBLANK('FY25-26 Work Plan'!$E$23:$E$23),\"\",'FY25-26 Work Plan'!$E$23:$E$23)","v":""},{"$f":"IF(ISBLANK('FY25-26 Work Plan'!$I$23:$I$23),\"\",'FY25-26 Work Plan'!$I$23:$I$23)","v":""},{"$f":"IF(ISBLANK('FY25-26 Work Plan'!$E$24:$E$24),\"\",'FY25-26 Work Plan'!$E$24:$E$24)","v":""},{"$f":"IF(ISBLANK('FY25-26 Work Plan'!$I$24:$I$24),\"\",'FY25-26 Work Plan'!$I$24:$I$24)","v":""},{"$f":"IF(ISBLANK('FY25-26 Work Plan'!$E$25:$E$25),\"\",'FY25-26 Work Plan'!$E$25:$E$25)","v":""},{"$f":"IF(ISBLANK('FY25-26 Work Plan'!$I$25:$I$25),\"\",'FY25-26 Work Plan'!$I$25:$I$25)","v":""},{"$f":"IF(ISBLANK('FY25-26 Work Plan'!$E$26:$E$26),\"\",'FY25-26 Work Plan'!$E$26:$E$26)","v":""},{"$f":"IF(ISBLANK('FY25-26 Work Plan'!$I$26:$I$26),\"\",'FY25-26 Work Plan'!$I$26:$I$26)","v":""},{"$f":"IF(ISBLANK('FY25-26 Work Plan'!$E$27:$E$27),\"\",'FY25-26 Work Plan'!$E$27:$E$27)","v":""},{"$f":"IF(ISBLANK('FY25-26 Work Plan'!$I$27:$I$27),\"\",'FY25-26 Work Plan'!$I$27:$I$27)","v":""},{"$f":"IF(ISBLANK('FY25-26 Work Plan'!$E$28:$E$28),\"\",'FY25-26 Work Plan'!$E$28:$E$28)","v":""},{"$f":"IF(ISBLANK('FY25-26 Work Plan'!$I$28:$I$28),\"\",'FY25-26 Work Plan'!$I$28:$I$28)","v":""},{"$f":"IF(ISBLANK('FY25-26 Work Plan'!$E$29:$E$29),\"\",'FY25-26 Work Plan'!$E$29:$E$29)","v":""},{"$f":"IF(ISBLANK('FY25-26 Work Plan'!$I$29:$I$29),\"\",'FY25-26 Work Plan'!$I$29:$I$29)","v":""},{"$f":"IF(ISBLANK('FY25-26 Work Plan'!$B$30:$B$30),\"\",'FY25-26 Work Plan'!$B$30:$B$30)","v":""},{"$f":"IF(ISBLANK('FY25-26 Work Plan'!$E$30:$E$30),\"\",'FY25-26 Work Plan'!$E$30:$E$30)","v":""},{"$f":"IF(ISBLANK('FY25-26 Work Plan'!$I$30:$I$30),\"\",'FY25-26 Work Plan'!$I$30:$I$30)","v":""},{"$f":"IF(ISBLANK('FY25-26 Work Plan'!$B$31:$B$31),\"\",'FY25-26 Work Plan'!$B$31:$B$31)","v":""},{"$f":"IF(ISBLANK('FY25-26 Work Plan'!$E$31:$E$31),\"\",'FY25-26 Work Plan'!$E$31:$E$31)","v":""},{"$f":"IF(ISBLANK('FY25-26 Work Plan'!$I$31:$I$31),\"\",'FY25-26 Work Plan'!$I$31:$I$31)","v":""},{"$f":"IF(ISBLANK('FY25-26 Work Plan'!$B$32:$B$32),\"\",'FY25-26 Work Plan'!$B$32:$B$32)","v":""},{"$f":"IF(ISBLANK('FY25-26 Work Plan'!$E$32:$E$32),\"\",'FY25-26 Work Plan'!$E$32:$E$32)","v":""},{"$f":"IF(ISBLANK('FY25-26 Work Plan'!$I$32:$I$32),\"\",'FY25-26 Work Plan'!$I$32:$I$32)","v":""},{"$f":"IF(ISBLANK('FY25-26 Work Plan'!#REF!),\"\",'FY25-26 Work Plan'!#REF!)","v":{"$error":"#REF!"}},{"$f":"IF(ISBLANK('FY25-26 Work Plan'!#REF!),\"\",'FY25-26 Work Plan'!#REF!)","v":{"$error":"#REF!"}},{"$f":"IF(ISBLANK('FY25-26 Work Plan'!#REF!),\"\",'FY25-26 Work Plan'!#REF!)","v":{"$error":"#REF!"}},{"$f":"IF(ISBLANK('FY25-26 Work Plan'!#REF!),\"\",'FY25-26 Work Plan'!#REF!)","v":{"$error":"#REF!"}},{"$f":"IF(ISBLANK('FY25-26 Work Plan'!#REF!),\"\",'FY25-26 Work Plan'!#REF!)","v":{"$error":"#REF!"}},{"$f":"IF(ISBLANK('FY25-26 Work Plan'!#REF!),\"\",'FY25-26 Work Plan'!#REF!)","v":{"$error":"#REF!"}},{"$f":"IF(ISBLANK('FY25-26 Work Plan'!#REF!),\"\",'FY25-26 Work Plan'!#REF!)","v":{"$error":"#REF!"}},{"$f":"IF(ISBLANK('FY25-26 Work Plan'!#REF!),\"\",'FY25-26 Work Plan'!#REF!)","v":{"$error":"#REF!"}},{"$f":"IF(ISBLANK('FY25-26 Work Plan'!#REF!),\"\",'FY25-26 Work Plan'!#REF!)","v":{"$error":"#REF!"}}]
[{"$f":"IF(ISBLANK('FY25-26 Work Plan'!$E$2:$E$2),\"\",'FY25-26 Work Plan'!$E$2:$E$2)","v":"Asian American Drug Abuse Programs, Inc. (AADAP)"},{"$f":"IF(ISBLANK('FY25-26 Work Plan'!$L$2:$L$2),\"\",'FY25-26 Work Plan'!$L$2:$L$2)","v":"Prevention Education Program (PEP)"},{"$f":"IF(ISBLANK('FY25-26 Work Plan'!$L$3:$L$3),\"\",'FY25-26 Work Plan'!$L$3:$L$3)","v":""},{"$f":"IF(ISBLANK('FY25-26 Work Plan'!$E$3:$E$3),\"\",'FY25-26 Work Plan'!$E$3:$E$3)","v":"PH-005150 "},{"$f":"IF(ISBLANK('FY25-26 Work Plan'!$E$4:$E$4),\"\",TEXT('FY25-26 Work Plan'!$E$4:$E$4,\"000000\"))","v":"000001"},{"$f":"IF(ISBLANK('FY25-26 Work Plan'!$L$4:$L$4),\"\",'FY25-26 Work Plan'!$L$4:$L$4)","v":""},{"$f":"IF(ISBLANK('FY25-26 Work Plan'!$E$5:$E$5),\"\",'FY25-26 Work Plan'!$E$5:$E$5)","v":"2 - San Fernando Valley"},{"$f":"IF(ISBLANK('FY25-26 Work Plan'!$L$5:$L$5),\"\",'FY25-26 Work Plan'!$L$5:$L$5)","v":""},{"$f":"IF(ISBLANK('FY25-26 Work Plan'!$E$6:$E$6),\"\",'FY25-26 Work Plan'!$E$6:$E$6)","v":"Agoura Hills, Agua Dulce*"},{"$f":"IF(ISBLANK('FY25-26 Work Plan'!$F$7:$F$7),\"\",'FY25-26 Work Plan'!$F$7:$F$7)","v":""},{"$f":"IF(ISBLANK('FY25-26 Work Plan'!$F$8:$F$8),\"\",'FY25-26 Work Plan'!$F$8:$F$8)","v":""},{"$f":"IF(ISBLANK('FY25-26 Work Plan'!$E$9:$E$9),\"\",'FY25-26 Work Plan'!$E$9:$E$9)","v":"123 E Main St., Suite 100 \nAnytown, CA 90000"},{"$f":"IF(ISBLANK('FY25-26 Work Plan'!$L$9:$L$9),\"\",TEXT('FY25-26 Work Plan'!$L$9:$L$9,\"###-###-####\"))","v":"999-999-9999"},{"$f":"IF(ISBLANK('FY25-26 Work Plan'!$L$10:$L$10),\"\",'FY25-26 Work Plan'!$L$10:$L$10)","v":"www.abc1.org"},{"$f":"IF(ISBLANK('FY25-26 Work Plan'!$E$11:$E$11),\"\",'FY25-26 Work Plan'!$E$11:$E$11)","v":"123 E Main St., Suite 100 \nAnytown, CA 90000"},{"$f":"IF(ISBLANK('FY25-26 Work Plan'!$L$11:$L$11),\"\",TEXT('FY25-26 Work Plan'!$L$11:$L$11,\"###-###-####\"))","v":"999-999-9999"},{"$f":"IF(ISBLANK('FY25-26 Work Plan'!$L$12:$L$12),\"\",'FY25-26 Work Plan'!$L$12:$L$12)","v":"www.abc2.org"},{"$f":"IF(ISBLANK('FY25-26 Work Plan'!$E$15:$E$15),\"\",'FY25-26 Work Plan'!$E$15:$E$15)","v":"John/Jane Doe"},{"$f":"IF(ISBLANK('FY25-26 Work Plan'!$I$15:$I$15),\"\",TEXT('FY25-26 Work Plan'!$I$15:$I$15,\"###-###-####\"))","v":"213-555-1212"},{"$f":"IF(ISBLANK('FY25-26 Work Plan'!$L$15:$L$15),\"\",'FY25-26 Work Plan'!$L$15:$L$15)","v":"janedoe@preventionusa.com"},{"$f":"IF(ISBLANK('FY25-26 Work Plan'!$E$16:$E$16),\"\",'FY25-26 Work Plan'!$E$16:$E$16)","v":"John/Jane Doe"},{"$f":"IF(ISBLANK('FY25-26 Work Plan'!$I$16:$I$16),\"\",TEXT('FY25-26 Work Plan'!$I$16:$I$16,\"###-###-####\"))","v":"213-555-1212"},{"$f":"IF(ISBLANK('FY25-26 Work Plan'!$L$16:$L$16),\"\",'FY25-26 Work Plan'!$L$16:$L$16)","v":"janedoe@preventionusa.com"},{"$f":"IF(ISBLANK('FY25-26 Work Plan'!$E$17:$E$17),\"\",'FY25-26 Work Plan'!$E$17:$E$17)","v":"John/Jane Doe"},{"$f":"IF(ISBLANK('FY25-26 Work Plan'!$I$17:$I$17),\"\",TEXT('FY25-26 Work Plan'!$I$17:$I$17,\"###-###-####\"))","v":"213-555-1212"},{"$f":"IF(ISBLANK('FY25-26 Work Plan'!$L$17:$L$17),\"\",'FY25-26 Work Plan'!$L$17:$L$17)","v":"j.doe@preventionusa.com"},{"$f":"IF(ISBLANK('FY25-26 Work Plan'!$E$18:$E$18),\"\",'FY25-26 Work Plan'!$E$18:$E$18)","v":"John/Jane Doe"},{"$f":"IF(ISBLANK('FY25-26 Work Plan'!$I$18:$I$18),\"\",TEXT('FY25-26 Work Plan'!$I$18:$I$18,\"###-###-####\"))","v":"213-555-1213"},{"$f":"IF(ISBLANK('FY25-26 Work Plan'!$L$18:$L$18),\"\",'FY25-26 Work Plan'!$L$18:$L$18)","v":"j.doe@preventionusa.com"},{"$f":"IF(ISBLANK('FY25-26 Work Plan'!$E$19:$E$19),\"\",'FY25-26 Work Plan'!$E$19:$E$19)","v":"John/Jane Doe"},{"$f":"IF(ISBLANK('FY25-26 Work Plan'!$I$19:$I$19),\"\",TEXT('FY25-26 Work Plan'!$I$19:$I$19,\"###-###-####\"))","v":"213-555-1213"},{"$f":"IF(ISBLANK('FY25-26 Work Plan'!$L$19:$L$19),\"\",'FY25-26 Work Plan'!$L$19:$L$19)","v":"j.doe@preventionusa.com"},{"$f":"IF(ISBLANK('FY25-26 Work Plan'!$E$23:$E$23),\"\",'FY25-26 Work Plan'!$E$23:$E$23)","v":""},{"$f":"IF(ISBLANK('FY25-26 Work Plan'!$I$23:$I$23),\"\",'FY25-26 Work Plan'!$I$23:$I$23)","v":""},{"$f":"IF(ISBLANK('FY25-26 Work Plan'!$E$24:$E$24),\"\",'FY25-26 Work Plan'!$E$24:$E$24)","v":""},{"$f":"IF(ISBLANK('FY25-26 Work Plan'!$I$24:$I$24),\"\",'FY25-26 Work Plan'!$I$24:$I$24)","v":""},{"$f":"IF(ISBLANK('FY25-26 Work Plan'!$E$25:$E$25),\"\",'FY25-26 Work Plan'!$E$25:$E$25)","v":""},{"$f":"IF(ISBLANK('FY25-26 Work Plan'!$I$25:$I$25),\"\",'FY25-26 Work Plan'!$I$25:$I$25)","v":""},{"$f":"IF(ISBLANK('FY25-26 Work Plan'!$E$26:$E$26),\"\",'FY25-26 Work Plan'!$E$26:$E$26)","v":""},{"$f":"IF(ISBLANK('FY25-26 Work Plan'!$I$26:$I$26),\"\",'FY25-26 Work Plan'!$I$26:$I$26)","v":""},{"$f":"IF(ISBLANK('FY25-26 Work Plan'!$E$27:$E$27),\"\",'FY25-26 Work Plan'!$E$27:$E$27)","v":""},{"$f":"IF(ISBLANK('FY25-26 Work Plan'!$I$27:$I$27),\"\",'FY25-26 Work Plan'!$I$27:$I$27)","v":""},{"$f":"IF(ISBLANK('FY25-26 Work Plan'!$E$28:$E$28),\"\",'FY25-26 Work Plan'!$E$28:$E$28)","v":""},{"$f":"IF(ISBLANK('FY25-26 Work Plan'!$I$28:$I$28),\"\",'FY25-26 Work Plan'!$I$28:$I$28)","v":""},{"$f":"IF(ISBLANK('FY25-26 Work Plan'!$E$29:$E$29),\"\",'FY25-26 Work Plan'!$E$29:$E$29)","v":""},{"$f":"IF(ISBLANK('FY25-26 Work Plan'!$I$29:$I$29),\"\",'FY25-26 Work Plan'!$I$29:$I$29)","v":""},{"$f":"IF(ISBLANK('FY25-26 Work Plan'!$B$30:$B$30),\"\",'FY25-26 Work Plan'!$B$30:$B$30)","v":""},{"$f":"IF(ISBLANK('FY25-26 Work Plan'!$E$30:$E$30),\"\",'FY25-26 Work Plan'!$E$30:$E$30)","v":""},{"$f":"IF(ISBLANK('FY25-26 Work Plan'!$I$30:$I$30),\"\",'FY25-26 Work Plan'!$I$30:$I$30)","v":""},{"$f":"IF(ISBLANK('FY25-26 Work Plan'!$B$31:$B$31),\"\",'FY25-26 Work Plan'!$B$31:$B$31)","v":""},{"$f":"IF(ISBLANK('FY25-26 Work Plan'!$E$31:$E$31),\"\",'FY25-26 Work Plan'!$E$31:$E$31)","v":""},{"$f":"IF(ISBLANK('FY25-26 Work Plan'!$I$31:$I$31),\"\",'FY25-26 Work Plan'!$I$31:$I$31)","v":""},{"$f":"IF(ISBLANK('FY25-26 Work Plan'!$B$32:$B$32),\"\",'FY25-26 Work Plan'!$B$32:$B$32)","v":""},{"$f":"IF(ISBLANK('FY25-26 Work Plan'!$E$32:$E$32),\"\",'FY25-26 Work Plan'!$E$32:$E$32)","v":""},{"$f":"IF(ISBLANK('FY25-26 Work Plan'!$I$32:$I$32),\"\",'FY25-26 Work Plan'!$I$32:$I$32)","v":""},{"$f":"IF(ISBLANK('FY25-26 Work Plan'!#REF!),\"\",'FY25-26 Work Plan'!#REF!)","v":{"$error":"#REF!"}},{"$f":"IF(ISBLANK('FY25-26 Work Plan'!#REF!),\"\",'FY25-26 Work Plan'!#REF!)","v":{"$error":"#REF!"}},{"$f":"IF(ISBLANK('FY25-26 Work Plan'!#REF!),\"\",'FY25-26 Work Plan'!#REF!)","v":{"$error":"#REF!"}},{"$f":"IF(ISBLANK('FY25-26 Work Plan'!#REF!),\"\",'FY25-26 Work Plan'!#REF!)","v":{"$error":"#REF!"}},{"$f":"IF(ISBLANK('FY25-26 Work Plan'!#REF!),\"\",'FY25-26 Work Plan'!#REF!)","v":{"$error":"#REF!"}},{"$f":"IF(ISBLANK('FY25-26 Work Plan'!#REF!),\"\",'FY25-26 Work Plan'!#REF!)","v":{"$error":"#REF!"}},{"$f":"IF(ISBLANK('FY25-26 Work Plan'!#REF!),\"\",'FY25-26 Work Plan'!#REF!)","v":{"$error":"#REF!"}},{"$f":"IF(ISBLANK('FY25-26 Work Plan'!#REF!),\"\",'FY25-26 Work Plan'!#REF!)","v":{"$error":"#REF!"}},{"$f":"IF(ISBLANK('FY25-26 Work Plan'!#REF!),\"\",'FY25-26 Work Plan'!#REF!)","v":{"$error":"#REF!"}}]
[{"$f":"IF(ISBLANK('FY25-26 Work Plan'!$E$2:$E$2),\"\",'FY25-26 Work Plan'!$E$2:$E$2)","v":"Asian American Drug Abuse Programs, Inc. (AADAP)"},{"$f":"IF(ISBLANK('FY25-26 Work Plan'!$L$2:$L$2),\"\",'FY25-26 Work Plan'!$L$2:$L$2)","v":"Prevention Education Program (PEP)"},{"$f":"IF(ISBLANK('FY25-26 Work Plan'!$L$3:$L$3),\"\",'FY25-26 Work Plan'!$L$3:$L$3)","v":""},{"$f":"IF(ISBLANK('FY25-26 Work Plan'!$E$3:$E$3),\"\",'FY25-26 Work Plan'!$E$3:$E$3)","v":"PH-005150 "},{"$f":"IF(ISBLANK('FY25-26 Work Plan'!$E$4:$E$4),\"\",TEXT('FY25-26 Work Plan'!$E$4:$E$4,\"000000\"))","v":"000001"},{"$f":"IF(ISBLANK('FY25-26 Work Plan'!$L$4:$L$4),\"\",'FY25-26 Work Plan'!$L$4:$L$4)","v":""},{"$f":"IF(ISBLANK('FY25-26 Work Plan'!$E$5:$E$5),\"\",'FY25-26 Work Plan'!$E$5:$E$5)","v":"2 - San Fernando Valley"},{"$f":"IF(ISBLANK('FY25-26 Work Plan'!$L$5:$L$5),\"\",'FY25-26 Work Plan'!$L$5:$L$5)","v":""},{"$f":"IF(ISBLANK('FY25-26 Work Plan'!$E$6:$E$6),\"\",'FY25-26 Work Plan'!$E$6:$E$6)","v":"Agoura Hills, Agua Dulce*"},{"$f":"IF(ISBLANK('FY25-26 Work Plan'!$F$7:$F$7),\"\",'FY25-26 Work Plan'!$F$7:$F$7)","v":""},{"$f":"IF(ISBLANK('FY25-26 Work Plan'!$F$8:$F$8),\"\",'FY25-26 Work Plan'!$F$8:$F$8)","v":""},{"$f":"IF(ISBLANK('FY25-26 Work Plan'!$E$9:$E$9),\"\",'FY25-26 Work Plan'!$E$9:$E$9)","v":"123 E Main St., Suite 100 \nAnytown, CA 90000"},{"$f":"IF(ISBLANK('FY25-26 Work Plan'!$L$9:$L$9),\"\",TEXT('FY25-26 Work Plan'!$L$9:$L$9,\"###-###-####\"))","v":"999-999-9999"},{"$f":"IF(ISBLANK('FY25-26 Work Plan'!$L$10:$L$10),\"\",'FY25-26 Work Plan'!$L$10:$L$10)","v":"www.abc1.org"},{"$f":"IF(ISBLANK('FY25-26 Work Plan'!$E$11:$E$11),\"\",'FY25-26 Work Plan'!$E$11:$E$11)","v":"123 E Main St., Suite 100 \nAnytown, CA 90000"},{"$f":"IF(ISBLANK('FY25-26 Work Plan'!$L$11:$L$11),\"\",TEXT('FY25-26 Work Plan'!$L$11:$L$11,\"###-###-####\"))","v":"999-999-9999"},{"$f":"IF(ISBLANK('FY25-26 Work Plan'!$L$12:$L$12),\"\",'FY25-26 Work Plan'!$L$12:$L$12)","v":"www.abc2.org"},{"$f":"IF(ISBLANK('FY25-26 Work Plan'!$E$15:$E$15),\"\",'FY25-26 Work Plan'!$E$15:$E$15)","v":"John/Jane Doe"},{"$f":"IF(ISBLANK('FY25-26 Work Plan'!$I$15:$I$15),\"\",TEXT('FY25-26 Work Plan'!$I$15:$I$15,\"###-###-####\"))","v":"213-555-1212"},{"$f":"IF(ISBLANK('FY25-26 Work Plan'!$L$15:$L$15),\"\",'FY25-26 Work Plan'!$L$15:$L$15)","v":"janedoe@preventionusa.com"},{"$f":"IF(ISBLANK('FY25-26 Work Plan'!$E$16:$E$16),\"\",'FY25-26 Work Plan'!$E$16:$E$16)","v":"John/Jane Doe"},{"$f":"IF(ISBLANK('FY25-26 Work Plan'!$I$16:$I$16),\"\",TEXT('FY25-26 Work Plan'!$I$16:$I$16,\"###-###-####\"))","v":"213-555-1212"},{"$f":"IF(ISBLANK('FY25-26 Work Plan'!$L$16:$L$16),\"\",'FY25-26 Work Plan'!$L$16:$L$16)","v":"janedoe@preventionusa.com"},{"$f":"IF(ISBLANK('FY25-26 Work Plan'!$E$17:$E$17),\"\",'FY25-26 Work Plan'!$E$17:$E$17)","v":"John/Jane Doe"},{"$f":"IF(ISBLANK('FY25-26 Work Plan'!$I$17:$I$17),\"\",TEXT('FY25-26 Work Plan'!$I$17:$I$17,\"###-###-####\"))","v":"213-555-1212"},{"$f":"IF(ISBLANK('FY25-26 Work Plan'!$L$17:$L$17),\"\",'FY25-26 Work Plan'!$L$17:$L$17)","v":"j.doe@preventionusa.com"},{"$f":"IF(ISBLANK('FY25-26 Work Plan'!$E$18:$E$18),\"\",'FY25-26 Work Plan'!$E$18:$E$18)","v":"John/Jane Doe"},{"$f":"IF(ISBLANK('FY25-26 Work Plan'!$I$18:$I$18),\"\",TEXT('FY25-26 Work Plan'!$I$18:$I$18,\"###-###-####\"))","v":"213-555-1213"},{"$f":"IF(ISBLANK('FY25-26 Work Plan'!$L$18:$L$18),\"\",'FY25-26 Work Plan'!$L$18:$L$18)","v":"j.doe@preventionusa.com"},{"$f":"IF(ISBLANK('FY25-26 Work Plan'!$E$19:$E$19),\"\",'FY25-26 Work Plan'!$E$19:$E$19)","v":"John/Jane Doe"},{"$f":"IF(ISBLANK('FY25-26 Work Plan'!$I$19:$I$19),\"\",TEXT('FY25-26 Work Plan'!$I$19:$I$19,\"###-###-####\"))","v":"213-555-1213"},{"$f":"IF(ISBLANK('FY25-26 Work Plan'!$L$19:$L$19),\"\",'FY25-26 Work Plan'!$L$19:$L$19)","v":"j.doe@preventionusa.com"},{"$f":"IF(ISBLANK('FY25-26 Work Plan'!$E$23:$E$23),\"\",'FY25-26 Work Plan'!$E$23:$E$23)","v":""},{"$f":"IF(ISBLANK('FY25-26 Work Plan'!$I$23:$I$23),\"\",'FY25-26 Work Plan'!$I$23:$I$23)","v":""},{"$f":"IF(ISBLANK('FY25-26 Work Plan'!$E$24:$E$24),\"\",'FY25-26 Work Plan'!$E$24:$E$24)","v":""},{"$f":"IF(ISBLANK('FY25-26 Work Plan'!$I$24:$I$24),\"\",'FY25-26 Work Plan'!$I$24:$I$24)","v":""},{"$f":"IF(ISBLANK('FY25-26 Work Plan'!$E$25:$E$25),\"\",'FY25-26 Work Plan'!$E$25:$E$25)","v":""},{"$f":"IF(ISBLANK('FY25-26 Work Plan'!$I$25:$I$25),\"\",'FY25-26 Work Plan'!$I$25:$I$25)","v":""},{"$f":"IF(ISBLANK('FY25-26 Work Plan'!$E$26:$E$26),\"\",'FY25-26 Work Plan'!$E$26:$E$26)","v":""},{"$f":"IF(ISBLANK('FY25-26 Work Plan'!$I$26:$I$26),\"\",'FY25-26 Work Plan'!$I$26:$I$26)","v":""},{"$f":"IF(ISBLANK('FY25-26 Work Plan'!$E$27:$E$27),\"\",'FY25-26 Work Plan'!$E$27:$E$27)","v":""},{"$f":"IF(ISBLANK('FY25-26 Work Plan'!$I$27:$I$27),\"\",'FY25-26 Work Plan'!$I$27:$I$27)","v":""},{"$f":"IF(ISBLANK('FY25-26 Work Plan'!$E$28:$E$28),\"\",'FY25-26 Work Plan'!$E$28:$E$28)","v":""},{"$f":"IF(ISBLANK('FY25-26 Work Plan'!$I$28:$I$28),\"\",'FY25-26 Work Plan'!$I$28:$I$28)","v":""},{"$f":"IF(ISBLANK('FY25-26 Work Plan'!$E$29:$E$29),\"\",'FY25-26 Work Plan'!$E$29:$E$29)","v":""},{"$f":"IF(ISBLANK('FY25-26 Work Plan'!$I$29:$I$29),\"\",'FY25-26 Work Plan'!$I$29:$I$29)","v":""},{"$f":"IF(ISBLANK('FY25-26 Work Plan'!$B$30:$B$30),\"\",'FY25-26 Work Plan'!$B$30:$B$30)","v":""},{"$f":"IF(ISBLANK('FY25-26 Work Plan'!$E$30:$E$30),\"\",'FY25-26 Work Plan'!$E$30:$E$30)","v":""},{"$f":"IF(ISBLANK('FY25-26 Work Plan'!$I$30:$I$30),\"\",'FY25-26 Work Plan'!$I$30:$I$30)","v":""},{"$f":"IF(ISBLANK('FY25-26 Work Plan'!$B$31:$B$31),\"\",'FY25-26 Work Plan'!$B$31:$B$31)","v":""},{"$f":"IF(ISBLANK('FY25-26 Work Plan'!$E$31:$E$31),\"\",'FY25-26 Work Plan'!$E$31:$E$31)","v":""},{"$f":"IF(ISBLANK('FY25-26 Work Plan'!$I$31:$I$31),\"\",'FY25-26 Work Plan'!$I$31:$I$31)","v":""},{"$f":"IF(ISBLANK('FY25-26 Work Plan'!$B$32:$B$32),\"\",'FY25-26 Work Plan'!$B$32:$B$32)","v":""},{"$f":"IF(ISBLANK('FY25-26 Work Plan'!$E$32:$E$32),\"\",'FY25-26 Work Plan'!$E$32:$E$32)","v":""},{"$f":"IF(ISBLANK('FY25-26 Work Plan'!$I$32:$I$32),\"\",'FY25-26 Work Plan'!$I$32:$I$32)","v":""},{"$f":"IF(ISBLANK('FY25-26 Work Plan'!#REF!),\"\",'FY25-26 Work Plan'!#REF!)","v":{"$error":"#REF!"}},{"$f":"IF(ISBLANK('FY25-26 Work Plan'!#REF!),\"\",'FY25-26 Work Plan'!#REF!)","v":{"$error":"#REF!"}},{"$f":"IF(ISBLANK('FY25-26 Work Plan'!#REF!),\"\",'FY25-26 Work Plan'!#REF!)","v":{"$error":"#REF!"}},{"$f":"IF(ISBLANK('FY25-26 Work Plan'!#REF!),\"\",'FY25-26 Work Plan'!#REF!)","v":{"$error":"#REF!"}},{"$f":"IF(ISBLANK('FY25-26 Work Plan'!#REF!),\"\",'FY25-26 Work Plan'!#REF!)","v":{"$error":"#REF!"}},{"$f":"IF(ISBLANK('FY25-26 Work Plan'!#REF!),\"\",'FY25-26 Work Plan'!#REF!)","v":{"$error":"#REF!"}},{"$f":"IF(ISBLANK('FY25-26 Work Plan'!#REF!),\"\",'FY25-26 Work Plan'!#REF!)","v":{"$error":"#REF!"}},{"$f":"IF(ISBLANK('FY25-26 Work Plan'!#REF!),\"\",'FY25-26 Work Plan'!#REF!)","v":{"$error":"#REF!"}},{"$f":"IF(ISBLANK('FY25-26 Work Plan'!#REF!),\"\",'FY25-26 Work Plan'!#REF!)","v":{"$error":"#REF!"}}]
[{"$f":"IF(ISBLANK('FY25-26 Work Plan'!$E$2:$E$2),\"\",'FY25-26 Work Plan'!$E$2:$E$2)","v":"Asian American Drug Abuse Programs, Inc. (AADAP)"},{"$f":"IF(ISBLANK('FY25-26 Work Plan'!$L$2:$L$2),\"\",'FY25-26 Work Plan'!$L$2:$L$2)","v":"Prevention Education Program (PEP)"},{"$f":"IF(ISBLANK('FY25-26 Work Plan'!$L$3:$L$3),\"\",'FY25-26 Work Plan'!$L$3:$L$3)","v":""},{"$f":"IF(ISBLANK('FY25-26 Work Plan'!$E$3:$E$3),\"\",'FY25-26 Work Plan'!$E$3:$E$3)","v":"PH-005150 "},{"$f":"IF(ISBLANK('FY25-26 Work Plan'!$E$4:$E$4),\"\",TEXT('FY25-26 Work Plan'!$E$4:$E$4,\"000000\"))","v":"000001"},{"$f":"IF(ISBLANK('FY25-26 Work Plan'!$L$4:$L$4),\"\",'FY25-26 Work Plan'!$L$4:$L$4)","v":""},{"$f":"IF(ISBLANK('FY25-26 Work Plan'!$E$5:$E$5),\"\",'FY25-26 Work Plan'!$E$5:$E$5)","v":"2 - San Fernando Valley"},{"$f":"IF(ISBLANK('FY25-26 Work Plan'!$L$5:$L$5),\"\",'FY25-26 Work Plan'!$L$5:$L$5)","v":""},{"$f":"IF(ISBLANK('FY25-26 Work Plan'!$E$6:$E$6),\"\",'FY25-26 Work Plan'!$E$6:$E$6)","v":"Agoura Hills, Agua Dulce*"},{"$f":"IF(ISBLANK('FY25-26 Work Plan'!$F$7:$F$7),\"\",'FY25-26 Work Plan'!$F$7:$F$7)","v":""},{"$f":"IF(ISBLANK('FY25-26 Work Plan'!$F$8:$F$8),\"\",'FY25-26 Work Plan'!$F$8:$F$8)","v":""},{"$f":"IF(ISBLANK('FY25-26 Work Plan'!$E$9:$E$9),\"\",'FY25-26 Work Plan'!$E$9:$E$9)","v":"123 E Main St., Suite 100 \nAnytown, CA 90000"},{"$f":"IF(ISBLANK('FY25-26 Work Plan'!$L$9:$L$9),\"\",TEXT('FY25-26 Work Plan'!$L$9:$L$9,\"###-###-####\"))","v":"999-999-9999"},{"$f":"IF(ISBLANK('FY25-26 Work Plan'!$L$10:$L$10),\"\",'FY25-26 Work Plan'!$L$10:$L$10)","v":"www.abc1.org"},{"$f":"IF(ISBLANK('FY25-26 Work Plan'!$E$11:$E$11),\"\",'FY25-26 Work Plan'!$E$11:$E$11)","v":"123 E Main St., Suite 100 \nAnytown, CA 90000"},{"$f":"IF(ISBLANK('FY25-26 Work Plan'!$L$11:$L$11),\"\",TEXT('FY25-26 Work Plan'!$L$11:$L$11,\"###-###-####\"))","v":"999-999-9999"},{"$f":"IF(ISBLANK('FY25-26 Work Plan'!$L$12:$L$12),\"\",'FY25-26 Work Plan'!$L$12:$L$12)","v":"www.abc2.org"},{"$f":"IF(ISBLANK('FY25-26 Work Plan'!$E$15:$E$15),\"\",'FY25-26 Work Plan'!$E$15:$E$15)","v":"John/Jane Doe"},{"$f":"IF(ISBLANK('FY25-26 Work Plan'!$I$15:$I$15),\"\",TEXT('FY25-26 Work Plan'!$I$15:$I$15,\"###-###-####\"))","v":"213-555-1212"},{"$f":"IF(ISBLANK('FY25-26 Work Plan'!$L$15:$L$15),\"\",'FY25-26 Work Plan'!$L$15:$L$15)","v":"janedoe@preventionusa.com"},{"$f":"IF(ISBLANK('FY25-26 Work Plan'!$E$16:$E$16),\"\",'FY25-26 Work Plan'!$E$16:$E$16)","v":"John/Jane Doe"},{"$f":"IF(ISBLANK('FY25-26 Work Plan'!$I$16:$I$16),\"\",TEXT('FY25-26 Work Plan'!$I$16:$I$16,\"###-###-####\"))","v":"213-555-1212"},{"$f":"IF(ISBLANK('FY25-26 Work Plan'!$L$16:$L$16),\"\",'FY25-26 Work Plan'!$L$16:$L$16)","v":"janedoe@preventionusa.com"},{"$f":"IF(ISBLANK('FY25-26 Work Plan'!$E$17:$E$17),\"\",'FY25-26 Work Plan'!$E$17:$E$17)","v":"John/Jane Doe"},{"$f":"IF(ISBLANK('FY25-26 Work Plan'!$I$17:$I$17),\"\",TEXT('FY25-26 Work Plan'!$I$17:$I$17,\"###-###-####\"))","v":"213-555-1212"},{"$f":"IF(ISBLANK('FY25-26 Work Plan'!$L$17:$L$17),\"\",'FY25-26 Work Plan'!$L$17:$L$17)","v":"j.doe@preventionusa.com"},{"$f":"IF(ISBLANK('FY25-26 Work Plan'!$E$18:$E$18),\"\",'FY25-26 Work Plan'!$E$18:$E$18)","v":"John/Jane Doe"},{"$f":"IF(ISBLANK('FY25-26 Work Plan'!$I$18:$I$18),\"\",TEXT('FY25-26 Work Plan'!$I$18:$I$18,\"###-###-####\"))","v":"213-555-1213"},{"$f":"IF(ISBLANK('FY25-26 Work Plan'!$L$18:$L$18),\"\",'FY25-26 Work Plan'!$L$18:$L$18)","v":"j.doe@preventionusa.com"},{"$f":"IF(ISBLANK('FY25-26 Work Plan'!$E$19:$E$19),\"\",'FY25-26 Work Plan'!$E$19:$E$19)","v":"John/Jane Doe"},{"$f":"IF(ISBLANK('FY25-26 Work Plan'!$I$19:$I$19),\"\",TEXT('FY25-26 Work Plan'!$I$19:$I$19,\"###-###-####\"))","v":"213-555-1213"},{"$f":"IF(ISBLANK('FY25-26 Work Plan'!$L$19:$L$19),\"\",'FY25-26 Work Plan'!$L$19:$L$19)","v":"j.doe@preventionusa.com"},{"$f":"IF(ISBLANK('FY25-26 Work Plan'!$E$23:$E$23),\"\",'FY25-26 Work Plan'!$E$23:$E$23)","v":""},{"$f":"IF(ISBLANK('FY25-26 Work Plan'!$I$23:$I$23),\"\",'FY25-26 Work Plan'!$I$23:$I$23)","v":""},{"$f":"IF(ISBLANK('FY25-26 Work Plan'!$E$24:$E$24),\"\",'FY25-26 Work Plan'!$E$24:$E$24)","v":""},{"$f":"IF(ISBLANK('FY25-26 Work Plan'!$I$24:$I$24),\"\",'FY25-26 Work Plan'!$I$24:$I$24)","v":""},{"$f":"IF(ISBLANK('FY25-26 Work Plan'!$E$25:$E$25),\"\",'FY25-26 Work Plan'!$E$25:$E$25)","v":""},{"$f":"IF(ISBLANK('FY25-26 Work Plan'!$I$25:$I$25),\"\",'FY25-26 Work Plan'!$I$25:$I$25)","v":""},{"$f":"IF(ISBLANK('FY25-26 Work Plan'!$E$26:$E$26),\"\",'FY25-26 Work Plan'!$E$26:$E$26)","v":""},{"$f":"IF(ISBLANK('FY25-26 Work Plan'!$I$26:$I$26),\"\",'FY25-26 Work Plan'!$I$26:$I$26)","v":""},{"$f":"IF(ISBLANK('FY25-26 Work Plan'!$E$27:$E$27),\"\",'FY25-26 Work Plan'!$E$27:$E$27)","v":""},{"$f":"IF(ISBLANK('FY25-26 Work Plan'!$I$27:$I$27),\"\",'FY25-26 Work Plan'!$I$27:$I$27)","v":""},{"$f":"IF(ISBLANK('FY25-26 Work Plan'!$E$28:$E$28),\"\",'FY25-26 Work Plan'!$E$28:$E$28)","v":""},{"$f":"IF(ISBLANK('FY25-26 Work Plan'!$I$28:$I$28),\"\",'FY25-26 Work Plan'!$I$28:$I$28)","v":""},{"$f":"IF(ISBLANK('FY25-26 Work Plan'!$E$29:$E$29),\"\",'FY25-26 Work Plan'!$E$29:$E$29)","v":""},{"$f":"IF(ISBLANK('FY25-26 Work Plan'!$I$29:$I$29),\"\",'FY25-26 Work Plan'!$I$29:$I$29)","v":""},{"$f":"IF(ISBLANK('FY25-26 Work Plan'!$B$30:$B$30),\"\",'FY25-26 Work Plan'!$B$30:$B$30)","v":""},{"$f":"IF(ISBLANK('FY25-26 Work Plan'!$E$30:$E$30),\"\",'FY25-26 Work Plan'!$E$30:$E$30)","v":""},{"$f":"IF(ISBLANK('FY25-26 Work Plan'!$I$30:$I$30),\"\",'FY25-26 Work Plan'!$I$30:$I$30)","v":""},{"$f":"IF(ISBLANK('FY25-26 Work Plan'!$B$31:$B$31),\"\",'FY25-26 Work Plan'!$B$31:$B$31)","v":""},{"$f":"IF(ISBLANK('FY25-26 Work Plan'!$E$31:$E$31),\"\",'FY25-26 Work Plan'!$E$31:$E$31)","v":""},{"$f":"IF(ISBLANK('FY25-26 Work Plan'!$I$31:$I$31),\"\",'FY25-26 Work Plan'!$I$31:$I$31)","v":""},{"$f":"IF(ISBLANK('FY25-26 Work Plan'!$B$32:$B$32),\"\",'FY25-26 Work Plan'!$B$32:$B$32)","v":""},{"$f":"IF(ISBLANK('FY25-26 Work Plan'!$E$32:$E$32),\"\",'FY25-26 Work Plan'!$E$32:$E$32)","v":""},{"$f":"IF(ISBLANK('FY25-26 Work Plan'!$I$32:$I$32),\"\",'FY25-26 Work Plan'!$I$32:$I$32)","v":""},{"$f":"IF(ISBLANK('FY25-26 Work Plan'!#REF!),\"\",'FY25-26 Work Plan'!#REF!)","v":{"$error":"#REF!"}},{"$f":"IF(ISBLANK('FY25-26 Work Plan'!#REF!),\"\",'FY25-26 Work Plan'!#REF!)","v":{"$error":"#REF!"}},{"$f":"IF(ISBLANK('FY25-26 Work Plan'!#REF!),\"\",'FY25-26 Work Plan'!#REF!)","v":{"$error":"#REF!"}},{"$f":"IF(ISBLANK('FY25-26 Work Plan'!#REF!),\"\",'FY25-26 Work Plan'!#REF!)","v":{"$error":"#REF!"}},{"$f":"IF(ISBLANK('FY25-26 Work Plan'!#REF!),\"\",'FY25-26 Work Plan'!#REF!)","v":{"$error":"#REF!"}},{"$f":"IF(ISBLANK('FY25-26 Work Plan'!#REF!),\"\",'FY25-26 Work Plan'!#REF!)","v":{"$error":"#REF!"}},{"$f":"IF(ISBLANK('FY25-26 Work Plan'!#REF!),\"\",'FY25-26 Work Plan'!#REF!)","v":{"$error":"#REF!"}},{"$f":"IF(ISBLANK('FY25-26 Work Plan'!#REF!),\"\",'FY25-26 Work Plan'!#REF!)","v":{"$error":"#REF!"}},{"$f":"IF(ISBLANK('FY25-26 Work Plan'!#REF!),\"\",'FY25-26 Work Plan'!#REF!)","v":{"$error":"#REF!"}}]
[{"$f":"IF(ISBLANK('FY25-26 Work Plan'!$E$2:$E$2),\"\",'FY25-26 Work Plan'!$E$2:$E$2)","v":"Asian American Drug Abuse Programs, Inc. (AADAP)"},{"$f":"IF(ISBLANK('FY25-26 Work Plan'!$L$2:$L$2),\"\",'FY25-26 Work Plan'!$L$2:$L$2)","v":"Prevention Education Program (PEP)"},{"$f":"IF(ISBLANK('FY25-26 Work Plan'!$L$3:$L$3),\"\",'FY25-26 Work Plan'!$L$3:$L$3)","v":""},{"$f":"IF(ISBLANK('FY25-26 Work Plan'!$E$3:$E$3),\"\",'FY25-26 Work Plan'!$E$3:$E$3)","v":"PH-005150 "},{"$f":"IF(ISBLANK('FY25-26 Work Plan'!$E$4:$E$4),\"\",TEXT('FY25-26 Work Plan'!$E$4:$E$4,\"000000\"))","v":"000001"},{"$f":"IF(ISBLANK('FY25-26 Work Plan'!$L$4:$L$4),\"\",'FY25-26 Work Plan'!$L$4:$L$4)","v":""},{"$f":"IF(ISBLANK('FY25-26 Work Plan'!$E$5:$E$5),\"\",'FY25-26 Work Plan'!$E$5:$E$5)","v":"2 - San Fernando Valley"},{"$f":"IF(ISBLANK('FY25-26 Work Plan'!$L$5:$L$5),\"\",'FY25-26 Work Plan'!$L$5:$L$5)","v":""},{"$f":"IF(ISBLANK('FY25-26 Work Plan'!$E$6:$E$6),\"\",'FY25-26 Work Plan'!$E$6:$E$6)","v":"Agoura Hills, Agua Dulce*"},{"$f":"IF(ISBLANK('FY25-26 Work Plan'!$F$7:$F$7),\"\",'FY25-26 Work Plan'!$F$7:$F$7)","v":""},{"$f":"IF(ISBLANK('FY25-26 Work Plan'!$F$8:$F$8),\"\",'FY25-26 Work Plan'!$F$8:$F$8)","v":""},{"$f":"IF(ISBLANK('FY25-26 Work Plan'!$E$9:$E$9),\"\",'FY25-26 Work Plan'!$E$9:$E$9)","v":"123 E Main St., Suite 100 \nAnytown, CA 90000"},{"$f":"IF(ISBLANK('FY25-26 Work Plan'!$L$9:$L$9),\"\",TEXT('FY25-26 Work Plan'!$L$9:$L$9,\"###-###-####\"))","v":"999-999-9999"},{"$f":"IF(ISBLANK('FY25-26 Work Plan'!$L$10:$L$10),\"\",'FY25-26 Work Plan'!$L$10:$L$10)","v":"www.abc1.org"},{"$f":"IF(ISBLANK('FY25-26 Work Plan'!$E$11:$E$11),\"\",'FY25-26 Work Plan'!$E$11:$E$11)","v":"123 E Main St., Suite 100 \nAnytown, CA 90000"},{"$f":"IF(ISBLANK('FY25-26 Work Plan'!$L$11:$L$11),\"\",TEXT('FY25-26 Work Plan'!$L$11:$L$11,\"###-###-####\"))","v":"999-999-9999"},{"$f":"IF(ISBLANK('FY25-26 Work Plan'!$L$12:$L$12),\"\",'FY25-26 Work Plan'!$L$12:$L$12)","v":"www.abc2.org"},{"$f":"IF(ISBLANK('FY25-26 Work Plan'!$E$15:$E$15),\"\",'FY25-26 Work Plan'!$E$15:$E$15)","v":"John/Jane Doe"},{"$f":"IF(ISBLANK('FY25-26 Work Plan'!$I$15:$I$15),\"\",TEXT('FY25-26 Work Plan'!$I$15:$I$15,\"###-###-####\"))","v":"213-555-1212"},{"$f":"IF(ISBLANK('FY25-26 Work Plan'!$L$15:$L$15),\"\",'FY25-26 Work Plan'!$L$15:$L$15)","v":"janedoe@preventionusa.com"},{"$f":"IF(ISBLANK('FY25-26 Work Plan'!$E$16:$E$16),\"\",'FY25-26 Work Plan'!$E$16:$E$16)","v":"John/Jane Doe"},{"$f":"IF(ISBLANK('FY25-26 Work Plan'!$I$16:$I$16),\"\",TEXT('FY25-26 Work Plan'!$I$16:$I$16,\"###-###-####\"))","v":"213-555-1212"},{"$f":"IF(ISBLANK('FY25-26 Work Plan'!$L$16:$L$16),\"\",'FY25-26 Work Plan'!$L$16:$L$16)","v":"janedoe@preventionusa.com"},{"$f":"IF(ISBLANK('FY25-26 Work Plan'!$E$17:$E$17),\"\",'FY25-26 Work Plan'!$E$17:$E$17)","v":"John/Jane Doe"},{"$f":"IF(ISBLANK('FY25-26 Work Plan'!$I$17:$I$17),\"\",TEXT('FY25-26 Work Plan'!$I$17:$I$17,\"###-###-####\"))","v":"213-555-1212"},{"$f":"IF(ISBLANK('FY25-26 Work Plan'!$L$17:$L$17),\"\",'FY25-26 Work Plan'!$L$17:$L$17)","v":"j.doe@preventionusa.com"},{"$f":"IF(ISBLANK('FY25-26 Work Plan'!$E$18:$E$18),\"\",'FY25-26 Work Plan'!$E$18:$E$18)","v":"John/Jane Doe"},{"$f":"IF(ISBLANK('FY25-26 Work Plan'!$I$18:$I$18),\"\",TEXT('FY25-26 Work Plan'!$I$18:$I$18,\"###-###-####\"))","v":"213-555-1213"},{"$f":"IF(ISBLANK('FY25-26 Work Plan'!$L$18:$L$18),\"\",'FY25-26 Work Plan'!$L$18:$L$18)","v":"j.doe@preventionusa.com"},{"$f":"IF(ISBLANK('FY25-26 Work Plan'!$E$19:$E$19),\"\",'FY25-26 Work Plan'!$E$19:$E$19)","v":"John/Jane Doe"},{"$f":"IF(ISBLANK('FY25-26 Work Plan'!$I$19:$I$19),\"\",TEXT('FY25-26 Work Plan'!$I$19:$I$19,\"###-###-####\"))","v":"213-555-1213"},{"$f":"IF(ISBLANK('FY25-26 Work Plan'!$L$19:$L$19),\"\",'FY25-26 Work Plan'!$L$19:$L$19)","v":"j.doe@preventionusa.com"},{"$f":"IF(ISBLANK('FY25-26 Work Plan'!$E$23:$E$23),\"\",'FY25-26 Work Plan'!$E$23:$E$23)","v":""},{"$f":"IF(ISBLANK('FY25-26 Work Plan'!$I$23:$I$23),\"\",'FY25-26 Work Plan'!$I$23:$I$23)","v":""},{"$f":"IF(ISBLANK('FY25-26 Work Plan'!$E$24:$E$24),\"\",'FY25-26 Work Plan'!$E$24:$E$24)","v":""},{"$f":"IF(ISBLANK('FY25-26 Work Plan'!$I$24:$I$24),\"\",'FY25-26 Work Plan'!$I$24:$I$24)","v":""},{"$f":"IF(ISBLANK('FY25-26 Work Plan'!$E$25:$E$25),\"\",'FY25-26 Work Plan'!$E$25:$E$25)","v":""},{"$f":"IF(ISBLANK('FY25-26 Work Plan'!$I$25:$I$25),\"\",'FY25-26 Work Plan'!$I$25:$I$25)","v":""},{"$f":"IF(ISBLANK('FY25-26 Work Plan'!$E$26:$E$26),\"\",'FY25-26 Work Plan'!$E$26:$E$26)","v":""},{"$f":"IF(ISBLANK('FY25-26 Work Plan'!$I$26:$I$26),\"\",'FY25-26 Work Plan'!$I$26:$I$26)","v":""},{"$f":"IF(ISBLANK('FY25-26 Work Plan'!$E$27:$E$27),\"\",'FY25-26 Work Plan'!$E$27:$E$27)","v":""},{"$f":"IF(ISBLANK('FY25-26 Work Plan'!$I$27:$I$27),\"\",'FY25-26 Work Plan'!$I$27:$I$27)","v":""},{"$f":"IF(ISBLANK('FY25-26 Work Plan'!$E$28:$E$28),\"\",'FY25-26 Work Plan'!$E$28:$E$28)","v":""},{"$f":"IF(ISBLANK('FY25-26 Work Plan'!$I$28:$I$28),\"\",'FY25-26 Work Plan'!$I$28:$I$28)","v":""},{"$f":"IF(ISBLANK('FY25-26 Work Plan'!$E$29:$E$29),\"\",'FY25-26 Work Plan'!$E$29:$E$29)","v":""},{"$f":"IF(ISBLANK('FY25-26 Work Plan'!$I$29:$I$29),\"\",'FY25-26 Work Plan'!$I$29:$I$29)","v":""},{"$f":"IF(ISBLANK('FY25-26 Work Plan'!$B$30:$B$30),\"\",'FY25-26 Work Plan'!$B$30:$B$30)","v":""},{"$f":"IF(ISBLANK('FY25-26 Work Plan'!$E$30:$E$30),\"\",'FY25-26 Work Plan'!$E$30:$E$30)","v":""},{"$f":"IF(ISBLANK('FY25-26 Work Plan'!$I$30:$I$30),\"\",'FY25-26 Work Plan'!$I$30:$I$30)","v":""},{"$f":"IF(ISBLANK('FY25-26 Work Plan'!$B$31:$B$31),\"\",'FY25-26 Work Plan'!$B$31:$B$31)","v":""},{"$f":"IF(ISBLANK('FY25-26 Work Plan'!$E$31:$E$31),\"\",'FY25-26 Work Plan'!$E$31:$E$31)","v":""},{"$f":"IF(ISBLANK('FY25-26 Work Plan'!$I$31:$I$31),\"\",'FY25-26 Work Plan'!$I$31:$I$31)","v":""},{"$f":"IF(ISBLANK('FY25-26 Work Plan'!$B$32:$B$32),\"\",'FY25-26 Work Plan'!$B$32:$B$32)","v":""},{"$f":"IF(ISBLANK('FY25-26 Work Plan'!$E$32:$E$32),\"\",'FY25-26 Work Plan'!$E$32:$E$32)","v":""},{"$f":"IF(ISBLANK('FY25-26 Work Plan'!$I$32:$I$32),\"\",'FY25-26 Work Plan'!$I$32:$I$32)","v":""},{"$f":"IF(ISBLANK('FY25-26 Work Plan'!#REF!),\"\",'FY25-26 Work Plan'!#REF!)","v":{"$error":"#REF!"}},{"$f":"IF(ISBLANK('FY25-26 Work Plan'!#REF!),\"\",'FY25-26 Work Plan'!#REF!)","v":{"$error":"#REF!"}},{"$f":"IF(ISBLANK('FY25-26 Work Plan'!#REF!),\"\",'FY25-26 Work Plan'!#REF!)","v":{"$error":"#REF!"}},{"$f":"IF(ISBLANK('FY25-26 Work Plan'!#REF!),\"\",'FY25-26 Work Plan'!#REF!)","v":{"$error":"#REF!"}},{"$f":"IF(ISBLANK('FY25-26 Work Plan'!#REF!),\"\",'FY25-26 Work Plan'!#REF!)","v":{"$error":"#REF!"}},{"$f":"IF(ISBLANK('FY25-26 Work Plan'!#REF!),\"\",'FY25-26 Work Plan'!#REF!)","v":{"$error":"#REF!"}},{"$f":"IF(ISBLANK('FY25-26 Work Plan'!#REF!),\"\",'FY25-26 Work Plan'!#REF!)","v":{"$error":"#REF!"}},{"$f":"IF(ISBLANK('FY25-26 Work Plan'!#REF!),\"\",'FY25-26 Work Plan'!#REF!)","v":{"$error":"#REF!"}},{"$f":"IF(ISBLANK('FY25-26 Work Plan'!#REF!),\"\",'FY25-26 Work Plan'!#REF!)","v":{"$error":"#REF!"}}]
[{"$f":"IF(ISBLANK('FY25-26 Work Plan'!$E$2:$E$2),\"\",'FY25-26 Work Plan'!$E$2:$E$2)","v":"Asian American Drug Abuse Programs, Inc. (AADAP)"},{"$f":"IF(ISBLANK('FY25-26 Work Plan'!$L$2:$L$2),\"\",'FY25-26 Work Plan'!$L$2:$L$2)","v":"Prevention Education Program (PEP)"},{"$f":"IF(ISBLANK('FY25-26 Work Plan'!$L$3:$L$3),\"\",'FY25-26 Work Plan'!$L$3:$L$3)","v":""},{"$f":"IF(ISBLANK('FY25-26 Work Plan'!$E$3:$E$3),\"\",'FY25-26 Work Plan'!$E$3:$E$3)","v":"PH-005150 "},{"$f":"IF(ISBLANK('FY25-26 Work Plan'!$E$4:$E$4),\"\",TEXT('FY25-26 Work Plan'!$E$4:$E$4,\"000000\"))","v":"000001"},{"$f":"IF(ISBLANK('FY25-26 Work Plan'!$L$4:$L$4),\"\",'FY25-26 Work Plan'!$L$4:$L$4)","v":""},{"$f":"IF(ISBLANK('FY25-26 Work Plan'!$E$5:$E$5),\"\",'FY25-26 Work Plan'!$E$5:$E$5)","v":"2 - San Fernando Valley"},{"$f":"IF(ISBLANK('FY25-26 Work Plan'!$L$5:$L$5),\"\",'FY25-26 Work Plan'!$L$5:$L$5)","v":""},{"$f":"IF(ISBLANK('FY25-26 Work Plan'!$E$6:$E$6),\"\",'FY25-26 Work Plan'!$E$6:$E$6)","v":"Agoura Hills, Agua Dulce*"},{"$f":"IF(ISBLANK('FY25-26 Work Plan'!$F$7:$F$7),\"\",'FY25-26 Work Plan'!$F$7:$F$7)","v":""},{"$f":"IF(ISBLANK('FY25-26 Work Plan'!$F$8:$F$8),\"\",'FY25-26 Work Plan'!$F$8:$F$8)","v":""},{"$f":"IF(ISBLANK('FY25-26 Work Plan'!$E$9:$E$9),\"\",'FY25-26 Work Plan'!$E$9:$E$9)","v":"123 E Main St., Suite 100 \nAnytown, CA 90000"},{"$f":"IF(ISBLANK('FY25-26 Work Plan'!$L$9:$L$9),\"\",TEXT('FY25-26 Work Plan'!$L$9:$L$9,\"###-###-####\"))","v":"999-999-9999"},{"$f":"IF(ISBLANK('FY25-26 Work Plan'!$L$10:$L$10),\"\",'FY25-26 Work Plan'!$L$10:$L$10)","v":"www.abc1.org"},{"$f":"IF(ISBLANK('FY25-26 Work Plan'!$E$11:$E$11),\"\",'FY25-26 Work Plan'!$E$11:$E$11)","v":"123 E Main St., Suite 100 \nAnytown, CA 90000"},{"$f":"IF(ISBLANK('FY25-26 Work Plan'!$L$11:$L$11),\"\",TEXT('FY25-26 Work Plan'!$L$11:$L$11,\"###-###-####\"))","v":"999-999-9999"},{"$f":"IF(ISBLANK('FY25-26 Work Plan'!$L$12:$L$12),\"\",'FY25-26 Work Plan'!$L$12:$L$12)","v":"www.abc2.org"},{"$f":"IF(ISBLANK('FY25-26 Work Plan'!$E$15:$E$15),\"\",'FY25-26 Work Plan'!$E$15:$E$15)","v":"John/Jane Doe"},{"$f":"IF(ISBLANK('FY25-26 Work Plan'!$I$15:$I$15),\"\",TEXT('FY25-26 Work Plan'!$I$15:$I$15,\"###-###-####\"))","v":"213-555-1212"},{"$f":"IF(ISBLANK('FY25-26 Work Plan'!$L$15:$L$15),\"\",'FY25-26 Work Plan'!$L$15:$L$15)","v":"janedoe@preventionusa.com"},{"$f":"IF(ISBLANK('FY25-26 Work Plan'!$E$16:$E$16),\"\",'FY25-26 Work Plan'!$E$16:$E$16)","v":"John/Jane Doe"},{"$f":"IF(ISBLANK('FY25-26 Work Plan'!$I$16:$I$16),\"\",TEXT('FY25-26 Work Plan'!$I$16:$I$16,\"###-###-####\"))","v":"213-555-1212"},{"$f":"IF(ISBLANK('FY25-26 Work Plan'!$L$16:$L$16),\"\",'FY25-26 Work Plan'!$L$16:$L$16)","v":"janedoe@preventionusa.com"},{"$f":"IF(ISBLANK('FY25-26 Work Plan'!$E$17:$E$17),\"\",'FY25-26 Work Plan'!$E$17:$E$17)","v":"John/Jane Doe"},{"$f":"IF(ISBLANK('FY25-26 Work Plan'!$I$17:$I$17),\"\",TEXT('FY25-26 Work Plan'!$I$17:$I$17,\"###-###-####\"))","v":"213-555-1212"},{"$f":"IF(ISBLANK('FY25-26 Work Plan'!$L$17:$L$17),\"\",'FY25-26 Work Plan'!$L$17:$L$17)","v":"j.doe@preventionusa.com"},{"$f":"IF(ISBLANK('FY25-26 Work Plan'!$E$18:$E$18),\"\",'FY25-26 Work Plan'!$E$18:$E$18)","v":"John/Jane Doe"},{"$f":"IF(ISBLANK('FY25-26 Work Plan'!$I$18:$I$18),\"\",TEXT('FY25-26 Work Plan'!$I$18:$I$18,\"###-###-####\"))","v":"213-555-1213"},{"$f":"IF(ISBLANK('FY25-26 Work Plan'!$L$18:$L$18),\"\",'FY25-26 Work Plan'!$L$18:$L$18)","v":"j.doe@preventionusa.com"},{"$f":"IF(ISBLANK('FY25-26 Work Plan'!$E$19:$E$19),\"\",'FY25-26 Work Plan'!$E$19:$E$19)","v":"John/Jane Doe"},{"$f":"IF(ISBLANK('FY25-26 Work Plan'!$I$19:$I$19),\"\",TEXT('FY25-26 Work Plan'!$I$19:$I$19,\"###-###-####\"))","v":"213-555-1213"},{"$f":"IF(ISBLANK('FY25-26 Work Plan'!$L$19:$L$19),\"\",'FY25-26 Work Plan'!$L$19:$L$19)","v":"j.doe@preventionusa.com"},{"$f":"IF(ISBLANK('FY25-26 Work Plan'!$E$23:$E$23),\"\",'FY25-26 Work Plan'!$E$23:$E$23)","v":""},{"$f":"IF(ISBLANK('FY25-26 Work Plan'!$I$23:$I$23),\"\",'FY25-26 Work Plan'!$I$23:$I$23)","v":""},{"$f":"IF(ISBLANK('FY25-26 Work Plan'!$E$24:$E$24),\"\",'FY25-26 Work Plan'!$E$24:$E$24)","v":""},{"$f":"IF(ISBLANK('FY25-26 Work Plan'!$I$24:$I$24),\"\",'FY25-26 Work Plan'!$I$24:$I$24)","v":""},{"$f":"IF(ISBLANK('FY25-26 Work Plan'!$E$25:$E$25),\"\",'FY25-26 Work Plan'!$E$25:$E$25)","v":""},{"$f":"IF(ISBLANK('FY25-26 Work Plan'!$I$25:$I$25),\"\",'FY25-26 Work Plan'!$I$25:$I$25)","v":""},{"$f":"IF(ISBLANK('FY25-26 Work Plan'!$E$26:$E$26),\"\",'FY25-26 Work Plan'!$E$26:$E$26)","v":""},{"$f":"IF(ISBLANK('FY25-26 Work Plan'!$I$26:$I$26),\"\",'FY25-26 Work Plan'!$I$26:$I$26)","v":""},{"$f":"IF(ISBLANK('FY25-26 Work Plan'!$E$27:$E$27),\"\",'FY25-26 Work Plan'!$E$27:$E$27)","v":""},{"$f":"IF(ISBLANK('FY25-26 Work Plan'!$I$27:$I$27),\"\",'FY25-26 Work Plan'!$I$27:$I$27)","v":""},{"$f":"IF(ISBLANK('FY25-26 Work Plan'!$E$28:$E$28),\"\",'FY25-26 Work Plan'!$E$28:$E$28)","v":""},{"$f":"IF(ISBLANK('FY25-26 Work Plan'!$I$28:$I$28),\"\",'FY25-26 Work Plan'!$I$28:$I$28)","v":""},{"$f":"IF(ISBLANK('FY25-26 Work Plan'!$E$29:$E$29),\"\",'FY25-26 Work Plan'!$E$29:$E$29)","v":""},{"$f":"IF(ISBLANK('FY25-26 Work Plan'!$I$29:$I$29),\"\",'FY25-26 Work Plan'!$I$29:$I$29)","v":""},{"$f":"IF(ISBLANK('FY25-26 Work Plan'!$B$30:$B$30),\"\",'FY25-26 Work Plan'!$B$30:$B$30)","v":""},{"$f":"IF(ISBLANK('FY25-26 Work Plan'!$E$30:$E$30),\"\",'FY25-26 Work Plan'!$E$30:$E$30)","v":""},{"$f":"IF(ISBLANK('FY25-26 Work Plan'!$I$30:$I$30),\"\",'FY25-26 Work Plan'!$I$30:$I$30)","v":""},{"$f":"IF(ISBLANK('FY25-26 Work Plan'!$B$31:$B$31),\"\",'FY25-26 Work Plan'!$B$31:$B$31)","v":""},{"$f":"IF(ISBLANK('FY25-26 Work Plan'!$E$31:$E$31),\"\",'FY25-26 Work Plan'!$E$31:$E$31)","v":""},{"$f":"IF(ISBLANK('FY25-26 Work Plan'!$I$31:$I$31),\"\",'FY25-26 Work Plan'!$I$31:$I$31)","v":""},{"$f":"IF(ISBLANK('FY25-26 Work Plan'!$B$32:$B$32),\"\",'FY25-26 Work Plan'!$B$32:$B$32)","v":""},{"$f":"IF(ISBLANK('FY25-26 Work Plan'!$E$32:$E$32),\"\",'FY25-26 Work Plan'!$E$32:$E$32)","v":""},{"$f":"IF(ISBLANK('FY25-26 Work Plan'!$I$32:$I$32),\"\",'FY25-26 Work Plan'!$I$32:$I$32)","v":""},{"$f":"IF(ISBLANK('FY25-26 Work Plan'!#REF!),\"\",'FY25-26 Work Plan'!#REF!)","v":{"$error":"#REF!"}},{"$f":"IF(ISBLANK('FY25-26 Work Plan'!#REF!),\"\",'FY25-26 Work Plan'!#REF!)","v":{"$error":"#REF!"}},{"$f":"IF(ISBLANK('FY25-26 Work Plan'!#REF!),\"\",'FY25-26 Work Plan'!#REF!)","v":{"$error":"#REF!"}},{"$f":"IF(ISBLANK('FY25-26 Work Plan'!#REF!),\"\",'FY25-26 Work Plan'!#REF!)","v":{"$error":"#REF!"}},{"$f":"IF(ISBLANK('FY25-26 Work Plan'!#REF!),\"\",'FY25-26 Work Plan'!#REF!)","v":{"$error":"#REF!"}},{"$f":"IF(ISBLANK('FY25-26 Work Plan'!#REF!),\"\",'FY25-26 Work Plan'!#REF!)","v":{"$error":"#REF!"}},{"$f":"IF(ISBLANK('FY25-26 Work Plan'!#REF!),\"\",'FY25-26 Work Plan'!#REF!)","v":{"$error":"#REF!"}},{"$f":"IF(ISBLANK('FY25-26 Work Plan'!#REF!),\"\",'FY25-26 Work Plan'!#REF!)","v":{"$error":"#REF!"}},{"$f":"IF(ISBLANK('FY25-26 Work Plan'!#REF!),\"\",'FY25-26 Work Plan'!#REF!)","v":{"$error":"#REF!"}}]
[{"$f":"IF(ISBLANK('FY25-26 Work Plan'!$E$2:$E$2),\"\",'FY25-26 Work Plan'!$E$2:$E$2)","v":"Asian American Drug Abuse Programs, Inc. (AADAP)"},{"$f":"IF(ISBLANK('FY25-26 Work Plan'!$L$2:$L$2),\"\",'FY25-26 Work Plan'!$L$2:$L$2)","v":"Prevention Education Program (PEP)"},{"$f":"IF(ISBLANK('FY25-26 Work Plan'!$L$3:$L$3),\"\",'FY25-26 Work Plan'!$L$3:$L$3)","v":""},{"$f":"IF(ISBLANK('FY25-26 Work Plan'!$E$3:$E$3),\"\",'FY25-26 Work Plan'!$E$3:$E$3)","v":"PH-005150 "},{"$f":"IF(ISBLANK('FY25-26 Work Plan'!$E$4:$E$4),\"\",TEXT('FY25-26 Work Plan'!$E$4:$E$4,\"000000\"))","v":"000001"},{"$f":"IF(ISBLANK('FY25-26 Work Plan'!$L$4:$L$4),\"\",'FY25-26 Work Plan'!$L$4:$L$4)","v":""},{"$f":"IF(ISBLANK('FY25-26 Work Plan'!$E$5:$E$5),\"\",'FY25-26 Work Plan'!$E$5:$E$5)","v":"2 - San Fernando Valley"},{"$f":"IF(ISBLANK('FY25-26 Work Plan'!$L$5:$L$5),\"\",'FY25-26 Work Plan'!$L$5:$L$5)","v":""},{"$f":"IF(ISBLANK('FY25-26 Work Plan'!$E$6:$E$6),\"\",'FY25-26 Work Plan'!$E$6:$E$6)","v":"Agoura Hills, Agua Dulce*"},{"$f":"IF(ISBLANK('FY25-26 Work Plan'!$F$7:$F$7),\"\",'FY25-26 Work Plan'!$F$7:$F$7)","v":""},{"$f":"IF(ISBLANK('FY25-26 Work Plan'!$F$8:$F$8),\"\",'FY25-26 Work Plan'!$F$8:$F$8)","v":""},{"$f":"IF(ISBLANK('FY25-26 Work Plan'!$E$9:$E$9),\"\",'FY25-26 Work Plan'!$E$9:$E$9)","v":"123 E Main St., Suite 100 \nAnytown, CA 90000"},{"$f":"IF(ISBLANK('FY25-26 Work Plan'!$L$9:$L$9),\"\",TEXT('FY25-26 Work Plan'!$L$9:$L$9,\"###-###-####\"))","v":"999-999-9999"},{"$f":"IF(ISBLANK('FY25-26 Work Plan'!$L$10:$L$10),\"\",'FY25-26 Work Plan'!$L$10:$L$10)","v":"www.abc1.org"},{"$f":"IF(ISBLANK('FY25-26 Work Plan'!$E$11:$E$11),\"\",'FY25-26 Work Plan'!$E$11:$E$11)","v":"123 E Main St., Suite 100 \nAnytown, CA 90000"},{"$f":"IF(ISBLANK('FY25-26 Work Plan'!$L$11:$L$11),\"\",TEXT('FY25-26 Work Plan'!$L$11:$L$11,\"###-###-####\"))","v":"999-999-9999"},{"$f":"IF(ISBLANK('FY25-26 Work Plan'!$L$12:$L$12),\"\",'FY25-26 Work Plan'!$L$12:$L$12)","v":"www.abc2.org"},{"$f":"IF(ISBLANK('FY25-26 Work Plan'!$E$15:$E$15),\"\",'FY25-26 Work Plan'!$E$15:$E$15)","v":"John/Jane Doe"},{"$f":"IF(ISBLANK('FY25-26 Work Plan'!$I$15:$I$15),\"\",TEXT('FY25-26 Work Plan'!$I$15:$I$15,\"###-###-####\"))","v":"213-555-1212"},{"$f":"IF(ISBLANK('FY25-26 Work Plan'!$L$15:$L$15),\"\",'FY25-26 Work Plan'!$L$15:$L$15)","v":"janedoe@preventionusa.com"},{"$f":"IF(ISBLANK('FY25-26 Work Plan'!$E$16:$E$16),\"\",'FY25-26 Work Plan'!$E$16:$E$16)","v":"John/Jane Doe"},{"$f":"IF(ISBLANK('FY25-26 Work Plan'!$I$16:$I$16),\"\",TEXT('FY25-26 Work Plan'!$I$16:$I$16,\"###-###-####\"))","v":"213-555-1212"},{"$f":"IF(ISBLANK('FY25-26 Work Plan'!$L$16:$L$16),\"\",'FY25-26 Work Plan'!$L$16:$L$16)","v":"janedoe@preventionusa.com"},{"$f":"IF(ISBLANK('FY25-26 Work Plan'!$E$17:$E$17),\"\",'FY25-26 Work Plan'!$E$17:$E$17)","v":"John/Jane Doe"},{"$f":"IF(ISBLANK('FY25-26 Work Plan'!$I$17:$I$17),\"\",TEXT('FY25-26 Work Plan'!$I$17:$I$17,\"###-###-####\"))","v":"213-555-1212"},{"$f":"IF(ISBLANK('FY25-26 Work Plan'!$L$17:$L$17),\"\",'FY25-26 Work Plan'!$L$17:$L$17)","v":"j.doe@preventionusa.com"},{"$f":"IF(ISBLANK('FY25-26 Work Plan'!$E$18:$E$18),\"\",'FY25-26 Work Plan'!$E$18:$E$18)","v":"John/Jane Doe"},{"$f":"IF(ISBLANK('FY25-26 Work Plan'!$I$18:$I$18),\"\",TEXT('FY25-26 Work Plan'!$I$18:$I$18,\"###-###-####\"))","v":"213-555-1213"},{"$f":"IF(ISBLANK('FY25-26 Work Plan'!$L$18:$L$18),\"\",'FY25-26 Work Plan'!$L$18:$L$18)","v":"j.doe@preventionusa.com"},{"$f":"IF(ISBLANK('FY25-26 Work Plan'!$E$19:$E$19),\"\",'FY25-26 Work Plan'!$E$19:$E$19)","v":"John/Jane Doe"},{"$f":"IF(ISBLANK('FY25-26 Work Plan'!$I$19:$I$19),\"\",TEXT('FY25-26 Work Plan'!$I$19:$I$19,\"###-###-####\"))","v":"213-555-1213"},{"$f":"IF(ISBLANK('FY25-26 Work Plan'!$L$19:$L$19),\"\",'FY25-26 Work Plan'!$L$19:$L$19)","v":"j.doe@preventionusa.com"},{"$f":"IF(ISBLANK('FY25-26 Work Plan'!$E$23:$E$23),\"\",'FY25-26 Work Plan'!$E$23:$E$23)","v":""},{"$f":"IF(ISBLANK('FY25-26 Work Plan'!$I$23:$I$23),\"\",'FY25-26 Work Plan'!$I$23:$I$23)","v":""},{"$f":"IF(ISBLANK('FY25-26 Work Plan'!$E$24:$E$24),\"\",'FY25-26 Work Plan'!$E$24:$E$24)","v":""},{"$f":"IF(ISBLANK('FY25-26 Work Plan'!$I$24:$I$24),\"\",'FY25-26 Work Plan'!$I$24:$I$24)","v":""},{"$f":"IF(ISBLANK('FY25-26 Work Plan'!$E$25:$E$25),\"\",'FY25-26 Work Plan'!$E$25:$E$25)","v":""},{"$f":"IF(ISBLANK('FY25-26 Work Plan'!$I$25:$I$25),\"\",'FY25-26 Work Plan'!$I$25:$I$25)","v":""},{"$f":"IF(ISBLANK('FY25-26 Work Plan'!$E$26:$E$26),\"\",'FY25-26 Work Plan'!$E$26:$E$26)","v":""},{"$f":"IF(ISBLANK('FY25-26 Work Plan'!$I$26:$I$26),\"\",'FY25-26 Work Plan'!$I$26:$I$26)","v":""},{"$f":"IF(ISBLANK('FY25-26 Work Plan'!$E$27:$E$27),\"\",'FY25-26 Work Plan'!$E$27:$E$27)","v":""},{"$f":"IF(ISBLANK('FY25-26 Work Plan'!$I$27:$I$27),\"\",'FY25-26 Work Plan'!$I$27:$I$27)","v":""},{"$f":"IF(ISBLANK('FY25-26 Work Plan'!$E$28:$E$28),\"\",'FY25-26 Work Plan'!$E$28:$E$28)","v":""},{"$f":"IF(ISBLANK('FY25-26 Work Plan'!$I$28:$I$28),\"\",'FY25-26 Work Plan'!$I$28:$I$28)","v":""},{"$f":"IF(ISBLANK('FY25-26 Work Plan'!$E$29:$E$29),\"\",'FY25-26 Work Plan'!$E$29:$E$29)","v":""},{"$f":"IF(ISBLANK('FY25-26 Work Plan'!$I$29:$I$29),\"\",'FY25-26 Work Plan'!$I$29:$I$29)","v":""},{"$f":"IF(ISBLANK('FY25-26 Work Plan'!$B$30:$B$30),\"\",'FY25-26 Work Plan'!$B$30:$B$30)","v":""},{"$f":"IF(ISBLANK('FY25-26 Work Plan'!$E$30:$E$30),\"\",'FY25-26 Work Plan'!$E$30:$E$30)","v":""},{"$f":"IF(ISBLANK('FY25-26 Work Plan'!$I$30:$I$30),\"\",'FY25-26 Work Plan'!$I$30:$I$30)","v":""},{"$f":"IF(ISBLANK('FY25-26 Work Plan'!$B$31:$B$31),\"\",'FY25-26 Work Plan'!$B$31:$B$31)","v":""},{"$f":"IF(ISBLANK('FY25-26 Work Plan'!$E$31:$E$31),\"\",'FY25-26 Work Plan'!$E$31:$E$31)","v":""},{"$f":"IF(ISBLANK('FY25-26 Work Plan'!$I$31:$I$31),\"\",'FY25-26 Work Plan'!$I$31:$I$31)","v":""},{"$f":"IF(ISBLANK('FY25-26 Work Plan'!$B$32:$B$32),\"\",'FY25-26 Work Plan'!$B$32:$B$32)","v":""},{"$f":"IF(ISBLANK('FY25-26 Work Plan'!$E$32:$E$32),\"\",'FY25-26 Work Plan'!$E$32:$E$32)","v":""},{"$f":"IF(ISBLANK('FY25-26 Work Plan'!$I$32:$I$32),\"\",'FY25-26 Work Plan'!$I$32:$I$32)","v":""},{"$f":"IF(ISBLANK('FY25-26 Work Plan'!#REF!),\"\",'FY25-26 Work Plan'!#REF!)","v":{"$error":"#REF!"}},{"$f":"IF(ISBLANK('FY25-26 Work Plan'!#REF!),\"\",'FY25-26 Work Plan'!#REF!)","v":{"$error":"#REF!"}},{"$f":"IF(ISBLANK('FY25-26 Work Plan'!#REF!),\"\",'FY25-26 Work Plan'!#REF!)","v":{"$error":"#REF!"}},{"$f":"IF(ISBLANK('FY25-26 Work Plan'!#REF!),\"\",'FY25-26 Work Plan'!#REF!)","v":{"$error":"#REF!"}},{"$f":"IF(ISBLANK('FY25-26 Work Plan'!#REF!),\"\",'FY25-26 Work Plan'!#REF!)","v":{"$error":"#REF!"}},{"$f":"IF(ISBLANK('FY25-26 Work Plan'!#REF!),\"\",'FY25-26 Work Plan'!#REF!)","v":{"$error":"#REF!"}},{"$f":"IF(ISBLANK('FY25-26 Work Plan'!#REF!),\"\",'FY25-26 Work Plan'!#REF!)","v":{"$error":"#REF!"}},{"$f":"IF(ISBLANK('FY25-26 Work Plan'!#REF!),\"\",'FY25-26 Work Plan'!#REF!)","v":{"$error":"#REF!"}},{"$f":"IF(ISBLANK('FY25-26 Work Plan'!#REF!),\"\",'FY25-26 Work Plan'!#REF!)","v":{"$error":"#REF!"}}]
[{"$f":"IF(ISBLANK('FY25-26 Work Plan'!$E$2:$E$2),\"\",'FY25-26 Work Plan'!$E$2:$E$2)","v":"Asian American Drug Abuse Programs, Inc. (AADAP)"},{"$f":"IF(ISBLANK('FY25-26 Work Plan'!$L$2:$L$2),\"\",'FY25-26 Work Plan'!$L$2:$L$2)","v":"Prevention Education Program (PEP)"},{"$f":"IF(ISBLANK('FY25-26 Work Plan'!$L$3:$L$3),\"\",'FY25-26 Work Plan'!$L$3:$L$3)","v":""},{"$f":"IF(ISBLANK('FY25-26 Work Plan'!$E$3:$E$3),\"\",'FY25-26 Work Plan'!$E$3:$E$3)","v":"PH-005150 "},{"$f":"IF(ISBLANK('FY25-26 Work Plan'!$E$4:$E$4),\"\",TEXT('FY25-26 Work Plan'!$E$4:$E$4,\"000000\"))","v":"000001"},{"$f":"IF(ISBLANK('FY25-26 Work Plan'!$L$4:$L$4),\"\",'FY25-26 Work Plan'!$L$4:$L$4)","v":""},{"$f":"IF(ISBLANK('FY25-26 Work Plan'!$E$5:$E$5),\"\",'FY25-26 Work Plan'!$E$5:$E$5)","v":"2 - San Fernando Valley"},{"$f":"IF(ISBLANK('FY25-26 Work Plan'!$L$5:$L$5),\"\",'FY25-26 Work Plan'!$L$5:$L$5)","v":""},{"$f":"IF(ISBLANK('FY25-26 Work Plan'!$E$6:$E$6),\"\",'FY25-26 Work Plan'!$E$6:$E$6)","v":"Agoura Hills, Agua Dulce*"},{"$f":"IF(ISBLANK('FY25-26 Work Plan'!$F$7:$F$7),\"\",'FY25-26 Work Plan'!$F$7:$F$7)","v":""},{"$f":"IF(ISBLANK('FY25-26 Work Plan'!$F$8:$F$8),\"\",'FY25-26 Work Plan'!$F$8:$F$8)","v":""},{"$f":"IF(ISBLANK('FY25-26 Work Plan'!$E$9:$E$9),\"\",'FY25-26 Work Plan'!$E$9:$E$9)","v":"123 E Main St., Suite 100 \nAnytown, CA 90000"},{"$f":"IF(ISBLANK('FY25-26 Work Plan'!$L$9:$L$9),\"\",TEXT('FY25-26 Work Plan'!$L$9:$L$9,\"###-###-####\"))","v":"999-999-9999"},{"$f":"IF(ISBLANK('FY25-26 Work Plan'!$L$10:$L$10),\"\",'FY25-26 Work Plan'!$L$10:$L$10)","v":"www.abc1.org"},{"$f":"IF(ISBLANK('FY25-26 Work Plan'!$E$11:$E$11),\"\",'FY25-26 Work Plan'!$E$11:$E$11)","v":"123 E Main St., Suite 100 \nAnytown, CA 90000"},{"$f":"IF(ISBLANK('FY25-26 Work Plan'!$L$11:$L$11),\"\",TEXT('FY25-26 Work Plan'!$L$11:$L$11,\"###-###-####\"))","v":"999-999-9999"},{"$f":"IF(ISBLANK('FY25-26 Work Plan'!$L$12:$L$12),\"\",'FY25-26 Work Plan'!$L$12:$L$12)","v":"www.abc2.org"},{"$f":"IF(ISBLANK('FY25-26 Work Plan'!$E$15:$E$15),\"\",'FY25-26 Work Plan'!$E$15:$E$15)","v":"John/Jane Doe"},{"$f":"IF(ISBLANK('FY25-26 Work Plan'!$I$15:$I$15),\"\",TEXT('FY25-26 Work Plan'!$I$15:$I$15,\"###-###-####\"))","v":"213-555-1212"},{"$f":"IF(ISBLANK('FY25-26 Work Plan'!$L$15:$L$15),\"\",'FY25-26 Work Plan'!$L$15:$L$15)","v":"janedoe@preventionusa.com"},{"$f":"IF(ISBLANK('FY25-26 Work Plan'!$E$16:$E$16),\"\",'FY25-26 Work Plan'!$E$16:$E$16)","v":"John/Jane Doe"},{"$f":"IF(ISBLANK('FY25-26 Work Plan'!$I$16:$I$16),\"\",TEXT('FY25-26 Work Plan'!$I$16:$I$16,\"###-###-####\"))","v":"213-555-1212"},{"$f":"IF(ISBLANK('FY25-26 Work Plan'!$L$16:$L$16),\"\",'FY25-26 Work Plan'!$L$16:$L$16)","v":"janedoe@preventionusa.com"},{"$f":"IF(ISBLANK('FY25-26 Work Plan'!$E$17:$E$17),\"\",'FY25-26 Work Plan'!$E$17:$E$17)","v":"John/Jane Doe"},{"$f":"IF(ISBLANK('FY25-26 Work Plan'!$I$17:$I$17),\"\",TEXT('FY25-26 Work Plan'!$I$17:$I$17,\"###-###-####\"))","v":"213-555-1212"},{"$f":"IF(ISBLANK('FY25-26 Work Plan'!$L$17:$L$17),\"\",'FY25-26 Work Plan'!$L$17:$L$17)","v":"j.doe@preventionusa.com"},{"$f":"IF(ISBLANK('FY25-26 Work Plan'!$E$18:$E$18),\"\",'FY25-26 Work Plan'!$E$18:$E$18)","v":"John/Jane Doe"},{"$f":"IF(ISBLANK('FY25-26 Work Plan'!$I$18:$I$18),\"\",TEXT('FY25-26 Work Plan'!$I$18:$I$18,\"###-###-####\"))","v":"213-555-1213"},{"$f":"IF(ISBLANK('FY25-26 Work Plan'!$L$18:$L$18),\"\",'FY25-26 Work Plan'!$L$18:$L$18)","v":"j.doe@preventionusa.com"},{"$f":"IF(ISBLANK('FY25-26 Work Plan'!$E$19:$E$19),\"\",'FY25-26 Work Plan'!$E$19:$E$19)","v":"John/Jane Doe"},{"$f":"IF(ISBLANK('FY25-26 Work Plan'!$I$19:$I$19),\"\",TEXT('FY25-26 Work Plan'!$I$19:$I$19,\"###-###-####\"))","v":"213-555-1213"},{"$f":"IF(ISBLANK('FY25-26 Work Plan'!$L$19:$L$19),\"\",'FY25-26 Work Plan'!$L$19:$L$19)","v":"j.doe@preventionusa.com"},{"$f":"IF(ISBLANK('FY25-26 Work Plan'!$E$23:$E$23),\"\",'FY25-26 Work Plan'!$E$23:$E$23)","v":""},{"$f":"IF(ISBLANK('FY25-26 Work Plan'!$I$23:$I$23),\"\",'FY25-26 Work Plan'!$I$23:$I$23)","v":""},{"$f":"IF(ISBLANK('FY25-26 Work Plan'!$E$24:$E$24),\"\",'FY25-26 Work Plan'!$E$24:$E$24)","v":""},{"$f":"IF(ISBLANK('FY25-26 Work Plan'!$I$24:$I$24),\"\",'FY25-26 Work Plan'!$I$24:$I$24)","v":""},{"$f":"IF(ISBLANK('FY25-26 Work Plan'!$E$25:$E$25),\"\",'FY25-26 Work Plan'!$E$25:$E$25)","v":""},{"$f":"IF(ISBLANK('FY25-26 Work Plan'!$I$25:$I$25),\"\",'FY25-26 Work Plan'!$I$25:$I$25)","v":""},{"$f":"IF(ISBLANK('FY25-26 Work Plan'!$E$26:$E$26),\"\",'FY25-26 Work Plan'!$E$26:$E$26)","v":""},{"$f":"IF(ISBLANK('FY25-26 Work Plan'!$I$26:$I$26),\"\",'FY25-26 Work Plan'!$I$26:$I$26)","v":""},{"$f":"IF(ISBLANK('FY25-26 Work Plan'!$E$27:$E$27),\"\",'FY25-26 Work Plan'!$E$27:$E$27)","v":""},{"$f":"IF(ISBLANK('FY25-26 Work Plan'!$I$27:$I$27),\"\",'FY25-26 Work Plan'!$I$27:$I$27)","v":""},{"$f":"IF(ISBLANK('FY25-26 Work Plan'!$E$28:$E$28),\"\",'FY25-26 Work Plan'!$E$28:$E$28)","v":""},{"$f":"IF(ISBLANK('FY25-26 Work Plan'!$I$28:$I$28),\"\",'FY25-26 Work Plan'!$I$28:$I$28)","v":""},{"$f":"IF(ISBLANK('FY25-26 Work Plan'!$E$29:$E$29),\"\",'FY25-26 Work Plan'!$E$29:$E$29)","v":""},{"$f":"IF(ISBLANK('FY25-26 Work Plan'!$I$29:$I$29),\"\",'FY25-26 Work Plan'!$I$29:$I$29)","v":""},{"$f":"IF(ISBLANK('FY25-26 Work Plan'!$B$30:$B$30),\"\",'FY25-26 Work Plan'!$B$30:$B$30)","v":""},{"$f":"IF(ISBLANK('FY25-26 Work Plan'!$E$30:$E$30),\"\",'FY25-26 Work Plan'!$E$30:$E$30)","v":""},{"$f":"IF(ISBLANK('FY25-26 Work Plan'!$I$30:$I$30),\"\",'FY25-26 Work Plan'!$I$30:$I$30)","v":""},{"$f":"IF(ISBLANK('FY25-26 Work Plan'!$B$31:$B$31),\"\",'FY25-26 Work Plan'!$B$31:$B$31)","v":""},{"$f":"IF(ISBLANK('FY25-26 Work Plan'!$E$31:$E$31),\"\",'FY25-26 Work Plan'!$E$31:$E$31)","v":""},{"$f":"IF(ISBLANK('FY25-26 Work Plan'!$I$31:$I$31),\"\",'FY25-26 Work Plan'!$I$31:$I$31)","v":""},{"$f":"IF(ISBLANK('FY25-26 Work Plan'!$B$32:$B$32),\"\",'FY25-26 Work Plan'!$B$32:$B$32)","v":""},{"$f":"IF(ISBLANK('FY25-26 Work Plan'!$E$32:$E$32),\"\",'FY25-26 Work Plan'!$E$32:$E$32)","v":""},{"$f":"IF(ISBLANK('FY25-26 Work Plan'!$I$32:$I$32),\"\",'FY25-26 Work Plan'!$I$32:$I$32)","v":""},{"$f":"IF(ISBLANK('FY25-26 Work Plan'!#REF!),\"\",'FY25-26 Work Plan'!#REF!)","v":{"$error":"#REF!"}},{"$f":"IF(ISBLANK('FY25-26 Work Plan'!#REF!),\"\",'FY25-26 Work Plan'!#REF!)","v":{"$error":"#REF!"}},{"$f":"IF(ISBLANK('FY25-26 Work Plan'!#REF!),\"\",'FY25-26 Work Plan'!#REF!)","v":{"$error":"#REF!"}},{"$f":"IF(ISBLANK('FY25-26 Work Plan'!#REF!),\"\",'FY25-26 Work Plan'!#REF!)","v":{"$error":"#REF!"}},{"$f":"IF(ISBLANK('FY25-26 Work Plan'!#REF!),\"\",'FY25-26 Work Plan'!#REF!)","v":{"$error":"#REF!"}},{"$f":"IF(ISBLANK('FY25-26 Work Plan'!#REF!),\"\",'FY25-26 Work Plan'!#REF!)","v":{"$error":"#REF!"}},{"$f":"IF(ISBLANK('FY25-26 Work Plan'!#REF!),\"\",'FY25-26 Work Plan'!#REF!)","v":{"$error":"#REF!"}},{"$f":"IF(ISBLANK('FY25-26 Work Plan'!#REF!),\"\",'FY25-26 Work Plan'!#REF!)","v":{"$error":"#REF!"}},{"$f":"IF(ISBLANK('FY25-26 Work Plan'!#REF!),\"\",'FY25-26 Work Plan'!#REF!)","v":{"$error":"#REF!"}}]
[{"$f":"IF(ISBLANK('FY25-26 Work Plan'!$E$2:$E$2),\"\",'FY25-26 Work Plan'!$E$2:$E$2)","v":"Asian American Drug Abuse Programs, Inc. (AADAP)"},{"$f":"IF(ISBLANK('FY25-26 Work Plan'!$L$2:$L$2),\"\",'FY25-26 Work Plan'!$L$2:$L$2)","v":"Prevention Education Program (PEP)"},{"$f":"IF(ISBLANK('FY25-26 Work Plan'!$L$3:$L$3),\"\",'FY25-26 Work Plan'!$L$3:$L$3)","v":""},{"$f":"IF(ISBLANK('FY25-26 Work Plan'!$E$3:$E$3),\"\",'FY25-26 Work Plan'!$E$3:$E$3)","v":"PH-005150 "},{"$f":"IF(ISBLANK('FY25-26 Work Plan'!$E$4:$E$4),\"\",TEXT('FY25-26 Work Plan'!$E$4:$E$4,\"000000\"))","v":"000001"},{"$f":"IF(ISBLANK('FY25-26 Work Plan'!$L$4:$L$4),\"\",'FY25-26 Work Plan'!$L$4:$L$4)","v":""},{"$f":"IF(ISBLANK('FY25-26 Work Plan'!$E$5:$E$5),\"\",'FY25-26 Work Plan'!$E$5:$E$5)","v":"2 - San Fernando Valley"},{"$f":"IF(ISBLANK('FY25-26 Work Plan'!$L$5:$L$5),\"\",'FY25-26 Work Plan'!$L$5:$L$5)","v":""},{"$f":"IF(ISBLANK('FY25-26 Work Plan'!$E$6:$E$6),\"\",'FY25-26 Work Plan'!$E$6:$E$6)","v":"Agoura Hills, Agua Dulce*"},{"$f":"IF(ISBLANK('FY25-26 Work Plan'!$F$7:$F$7),\"\",'FY25-26 Work Plan'!$F$7:$F$7)","v":""},{"$f":"IF(ISBLANK('FY25-26 Work Plan'!$F$8:$F$8),\"\",'FY25-26 Work Plan'!$F$8:$F$8)","v":""},{"$f":"IF(ISBLANK('FY25-26 Work Plan'!$E$9:$E$9),\"\",'FY25-26 Work Plan'!$E$9:$E$9)","v":"123 E Main St., Suite 100 \nAnytown, CA 90000"},{"$f":"IF(ISBLANK('FY25-26 Work Plan'!$L$9:$L$9),\"\",TEXT('FY25-26 Work Plan'!$L$9:$L$9,\"###-###-####\"))","v":"999-999-9999"},{"$f":"IF(ISBLANK('FY25-26 Work Plan'!$L$10:$L$10),\"\",'FY25-26 Work Plan'!$L$10:$L$10)","v":"www.abc1.org"},{"$f":"IF(ISBLANK('FY25-26 Work Plan'!$E$11:$E$11),\"\",'FY25-26 Work Plan'!$E$11:$E$11)","v":"123 E Main St., Suite 100 \nAnytown, CA 90000"},{"$f":"IF(ISBLANK('FY25-26 Work Plan'!$L$11:$L$11),\"\",TEXT('FY25-26 Work Plan'!$L$11:$L$11,\"###-###-####\"))","v":"999-999-9999"},{"$f":"IF(ISBLANK('FY25-26 Work Plan'!$L$12:$L$12),\"\",'FY25-26 Work Plan'!$L$12:$L$12)","v":"www.abc2.org"},{"$f":"IF(ISBLANK('FY25-26 Work Plan'!$E$15:$E$15),\"\",'FY25-26 Work Plan'!$E$15:$E$15)","v":"John/Jane Doe"},{"$f":"IF(ISBLANK('FY25-26 Work Plan'!$I$15:$I$15),\"\",TEXT('FY25-26 Work Plan'!$I$15:$I$15,\"###-###-####\"))","v":"213-555-1212"},{"$f":"IF(ISBLANK('FY25-26 Work Plan'!$L$15:$L$15),\"\",'FY25-26 Work Plan'!$L$15:$L$15)","v":"janedoe@preventionusa.com"},{"$f":"IF(ISBLANK('FY25-26 Work Plan'!$E$16:$E$16),\"\",'FY25-26 Work Plan'!$E$16:$E$16)","v":"John/Jane Doe"},{"$f":"IF(ISBLANK('FY25-26 Work Plan'!$I$16:$I$16),\"\",TEXT('FY25-26 Work Plan'!$I$16:$I$16,\"###-###-####\"))","v":"213-555-1212"},{"$f":"IF(ISBLANK('FY25-26 Work Plan'!$L$16:$L$16),\"\",'FY25-26 Work Plan'!$L$16:$L$16)","v":"janedoe@preventionusa.com"},{"$f":"IF(ISBLANK('FY25-26 Work Plan'!$E$17:$E$17),\"\",'FY25-26 Work Plan'!$E$17:$E$17)","v":"John/Jane Doe"},{"$f":"IF(ISBLANK('FY25-26 Work Plan'!$I$17:$I$17),\"\",TEXT('FY25-26 Work Plan'!$I$17:$I$17,\"###-###-####\"))","v":"213-555-1212"},{"$f":"IF(ISBLANK('FY25-26 Work Plan'!$L$17:$L$17),\"\",'FY25-26 Work Plan'!$L$17:$L$17)","v":"j.doe@preventionusa.com"},{"$f":"IF(ISBLANK('FY25-26 Work Plan'!$E$18:$E$18),\"\",'FY25-26 Work Plan'!$E$18:$E$18)","v":"John/Jane Doe"},{"$f":"IF(ISBLANK('FY25-26 Work Plan'!$I$18:$I$18),\"\",TEXT('FY25-26 Work Plan'!$I$18:$I$18,\"###-###-####\"))","v":"213-555-1213"},{"$f":"IF(ISBLANK('FY25-26 Work Plan'!$L$18:$L$18),\"\",'FY25-26 Work Plan'!$L$18:$L$18)","v":"j.doe@preventionusa.com"},{"$f":"IF(ISBLANK('FY25-26 Work Plan'!$E$19:$E$19),\"\",'FY25-26 Work Plan'!$E$19:$E$19)","v":"John/Jane Doe"},{"$f":"IF(ISBLANK('FY25-26 Work Plan'!$I$19:$I$19),\"\",TEXT('FY25-26 Work Plan'!$I$19:$I$19,\"###-###-####\"))","v":"213-555-1213"},{"$f":"IF(ISBLANK('FY25-26 Work Plan'!$L$19:$L$19),\"\",'FY25-26 Work Plan'!$L$19:$L$19)","v":"j.doe@preventionusa.com"},{"$f":"IF(ISBLANK('FY25-26 Work Plan'!$E$23:$E$23),\"\",'FY25-26 Work Plan'!$E$23:$E$23)","v":""},{"$f":"IF(ISBLANK('FY25-26 Work Plan'!$I$23:$I$23),\"\",'FY25-26 Work Plan'!$I$23:$I$23)","v":""},{"$f":"IF(ISBLANK('FY25-26 Work Plan'!$E$24:$E$24),\"\",'FY25-26 Work Plan'!$E$24:$E$24)","v":""},{"$f":"IF(ISBLANK('FY25-26 Work Plan'!$I$24:$I$24),\"\",'FY25-26 Work Plan'!$I$24:$I$24)","v":""},{"$f":"IF(ISBLANK('FY25-26 Work Plan'!$E$25:$E$25),\"\",'FY25-26 Work Plan'!$E$25:$E$25)","v":""},{"$f":"IF(ISBLANK('FY25-26 Work Plan'!$I$25:$I$25),\"\",'FY25-26 Work Plan'!$I$25:$I$25)","v":""},{"$f":"IF(ISBLANK('FY25-26 Work Plan'!$E$26:$E$26),\"\",'FY25-26 Work Plan'!$E$26:$E$26)","v":""},{"$f":"IF(ISBLANK('FY25-26 Work Plan'!$I$26:$I$26),\"\",'FY25-26 Work Plan'!$I$26:$I$26)","v":""},{"$f":"IF(ISBLANK('FY25-26 Work Plan'!$E$27:$E$27),\"\",'FY25-26 Work Plan'!$E$27:$E$27)","v":""},{"$f":"IF(ISBLANK('FY25-26 Work Plan'!$I$27:$I$27),\"\",'FY25-26 Work Plan'!$I$27:$I$27)","v":""},{"$f":"IF(ISBLANK('FY25-26 Work Plan'!$E$28:$E$28),\"\",'FY25-26 Work Plan'!$E$28:$E$28)","v":""},{"$f":"IF(ISBLANK('FY25-26 Work Plan'!$I$28:$I$28),\"\",'FY25-26 Work Plan'!$I$28:$I$28)","v":""},{"$f":"IF(ISBLANK('FY25-26 Work Plan'!$E$29:$E$29),\"\",'FY25-26 Work Plan'!$E$29:$E$29)","v":""},{"$f":"IF(ISBLANK('FY25-26 Work Plan'!$I$29:$I$29),\"\",'FY25-26 Work Plan'!$I$29:$I$29)","v":""},{"$f":"IF(ISBLANK('FY25-26 Work Plan'!$B$30:$B$30),\"\",'FY25-26 Work Plan'!$B$30:$B$30)","v":""},{"$f":"IF(ISBLANK('FY25-26 Work Plan'!$E$30:$E$30),\"\",'FY25-26 Work Plan'!$E$30:$E$30)","v":""},{"$f":"IF(ISBLANK('FY25-26 Work Plan'!$I$30:$I$30),\"\",'FY25-26 Work Plan'!$I$30:$I$30)","v":""},{"$f":"IF(ISBLANK('FY25-26 Work Plan'!$B$31:$B$31),\"\",'FY25-26 Work Plan'!$B$31:$B$31)","v":""},{"$f":"IF(ISBLANK('FY25-26 Work Plan'!$E$31:$E$31),\"\",'FY25-26 Work Plan'!$E$31:$E$31)","v":""},{"$f":"IF(ISBLANK('FY25-26 Work Plan'!$I$31:$I$31),\"\",'FY25-26 Work Plan'!$I$31:$I$31)","v":""},{"$f":"IF(ISBLANK('FY25-26 Work Plan'!$B$32:$B$32),\"\",'FY25-26 Work Plan'!$B$32:$B$32)","v":""},{"$f":"IF(ISBLANK('FY25-26 Work Plan'!$E$32:$E$32),\"\",'FY25-26 Work Plan'!$E$32:$E$32)","v":""},{"$f":"IF(ISBLANK('FY25-26 Work Plan'!$I$32:$I$32),\"\",'FY25-26 Work Plan'!$I$32:$I$32)","v":""},{"$f":"IF(ISBLANK('FY25-26 Work Plan'!#REF!),\"\",'FY25-26 Work Plan'!#REF!)","v":{"$error":"#REF!"}},{"$f":"IF(ISBLANK('FY25-26 Work Plan'!#REF!),\"\",'FY25-26 Work Plan'!#REF!)","v":{"$error":"#REF!"}},{"$f":"IF(ISBLANK('FY25-26 Work Plan'!#REF!),\"\",'FY25-26 Work Plan'!#REF!)","v":{"$error":"#REF!"}},{"$f":"IF(ISBLANK('FY25-26 Work Plan'!#REF!),\"\",'FY25-26 Work Plan'!#REF!)","v":{"$error":"#REF!"}},{"$f":"IF(ISBLANK('FY25-26 Work Plan'!#REF!),\"\",'FY25-26 Work Plan'!#REF!)","v":{"$error":"#REF!"}},{"$f":"IF(ISBLANK('FY25-26 Work Plan'!#REF!),\"\",'FY25-26 Work Plan'!#REF!)","v":{"$error":"#REF!"}},{"$f":"IF(ISBLANK('FY25-26 Work Plan'!#REF!),\"\",'FY25-26 Work Plan'!#REF!)","v":{"$error":"#REF!"}},{"$f":"IF(ISBLANK('FY25-26 Work Plan'!#REF!),\"\",'FY25-26 Work Plan'!#REF!)","v":{"$error":"#REF!"}},{"$f":"IF(ISBLANK('FY25-26 Work Plan'!#REF!),\"\",'FY25-26 Work Plan'!#REF!)","v":{"$error":"#REF!"}}]
[{"$f":"IF(ISBLANK('FY25-26 Work Plan'!$E$2:$E$2),\"\",'FY25-26 Work Plan'!$E$2:$E$2)","v":"Asian American Drug Abuse Programs, Inc. (AADAP)"},{"$f":"IF(ISBLANK('FY25-26 Work Plan'!$L$2:$L$2),\"\",'FY25-26 Work Plan'!$L$2:$L$2)","v":"Prevention Education Program (PEP)"},{"$f":"IF(ISBLANK('FY25-26 Work Plan'!$L$3:$L$3),\"\",'FY25-26 Work Plan'!$L$3:$L$3)","v":""},{"$f":"IF(ISBLANK('FY25-26 Work Plan'!$E$3:$E$3),\"\",'FY25-26 Work Plan'!$E$3:$E$3)","v":"PH-005150 "},{"$f":"IF(ISBLANK('FY25-26 Work Plan'!$E$4:$E$4),\"\",TEXT('FY25-26 Work Plan'!$E$4:$E$4,\"000000\"))","v":"000001"},{"$f":"IF(ISBLANK('FY25-26 Work Plan'!$L$4:$L$4),\"\",'FY25-26 Work Plan'!$L$4:$L$4)","v":""},{"$f":"IF(ISBLANK('FY25-26 Work Plan'!$E$5:$E$5),\"\",'FY25-26 Work Plan'!$E$5:$E$5)","v":"2 - San Fernando Valley"},{"$f":"IF(ISBLANK('FY25-26 Work Plan'!$L$5:$L$5),\"\",'FY25-26 Work Plan'!$L$5:$L$5)","v":""},{"$f":"IF(ISBLANK('FY25-26 Work Plan'!$E$6:$E$6),\"\",'FY25-26 Work Plan'!$E$6:$E$6)","v":"Agoura Hills, Agua Dulce*"},{"$f":"IF(ISBLANK('FY25-26 Work Plan'!$F$7:$F$7),\"\",'FY25-26 Work Plan'!$F$7:$F$7)","v":""},{"$f":"IF(ISBLANK('FY25-26 Work Plan'!$F$8:$F$8),\"\",'FY25-26 Work Plan'!$F$8:$F$8)","v":""},{"$f":"IF(ISBLANK('FY25-26 Work Plan'!$E$9:$E$9),\"\",'FY25-26 Work Plan'!$E$9:$E$9)","v":"123 E Main St., Suite 100 \nAnytown, CA 90000"},{"$f":"IF(ISBLANK('FY25-26 Work Plan'!$L$9:$L$9),\"\",TEXT('FY25-26 Work Plan'!$L$9:$L$9,\"###-###-####\"))","v":"999-999-9999"},{"$f":"IF(ISBLANK('FY25-26 Work Plan'!$L$10:$L$10),\"\",'FY25-26 Work Plan'!$L$10:$L$10)","v":"www.abc1.org"},{"$f":"IF(ISBLANK('FY25-26 Work Plan'!$E$11:$E$11),\"\",'FY25-26 Work Plan'!$E$11:$E$11)","v":"123 E Main St., Suite 100 \nAnytown, CA 90000"},{"$f":"IF(ISBLANK('FY25-26 Work Plan'!$L$11:$L$11),\"\",TEXT('FY25-26 Work Plan'!$L$11:$L$11,\"###-###-####\"))","v":"999-999-9999"},{"$f":"IF(ISBLANK('FY25-26 Work Plan'!$L$12:$L$12),\"\",'FY25-26 Work Plan'!$L$12:$L$12)","v":"www.abc2.org"},{"$f":"IF(ISBLANK('FY25-26 Work Plan'!$E$15:$E$15),\"\",'FY25-26 Work Plan'!$E$15:$E$15)","v":"John/Jane Doe"},{"$f":"IF(ISBLANK('FY25-26 Work Plan'!$I$15:$I$15),\"\",TEXT('FY25-26 Work Plan'!$I$15:$I$15,\"###-###-####\"))","v":"213-555-1212"},{"$f":"IF(ISBLANK('FY25-26 Work Plan'!$L$15:$L$15),\"\",'FY25-26 Work Plan'!$L$15:$L$15)","v":"janedoe@preventionusa.com"},{"$f":"IF(ISBLANK('FY25-26 Work Plan'!$E$16:$E$16),\"\",'FY25-26 Work Plan'!$E$16:$E$16)","v":"John/Jane Doe"},{"$f":"IF(ISBLANK('FY25-26 Work Plan'!$I$16:$I$16),\"\",TEXT('FY25-26 Work Plan'!$I$16:$I$16,\"###-###-####\"))","v":"213-555-1212"},{"$f":"IF(ISBLANK('FY25-26 Work Plan'!$L$16:$L$16),\"\",'FY25-26 Work Plan'!$L$16:$L$16)","v":"janedoe@preventionusa.com"},{"$f":"IF(ISBLANK('FY25-26 Work Plan'!$E$17:$E$17),\"\",'FY25-26 Work Plan'!$E$17:$E$17)","v":"John/Jane Doe"},{"$f":"IF(ISBLANK('FY25-26 Work Plan'!$I$17:$I$17),\"\",TEXT('FY25-26 Work Plan'!$I$17:$I$17,\"###-###-####\"))","v":"213-555-1212"},{"$f":"IF(ISBLANK('FY25-26 Work Plan'!$L$17:$L$17),\"\",'FY25-26 Work Plan'!$L$17:$L$17)","v":"j.doe@preventionusa.com"},{"$f":"IF(ISBLANK('FY25-26 Work Plan'!$E$18:$E$18),\"\",'FY25-26 Work Plan'!$E$18:$E$18)","v":"John/Jane Doe"},{"$f":"IF(ISBLANK('FY25-26 Work Plan'!$I$18:$I$18),\"\",TEXT('FY25-26 Work Plan'!$I$18:$I$18,\"###-###-####\"))","v":"213-555-1213"},{"$f":"IF(ISBLANK('FY25-26 Work Plan'!$L$18:$L$18),\"\",'FY25-26 Work Plan'!$L$18:$L$18)","v":"j.doe@preventionusa.com"},{"$f":"IF(ISBLANK('FY25-26 Work Plan'!$E$19:$E$19),\"\",'FY25-26 Work Plan'!$E$19:$E$19)","v":"John/Jane Doe"},{"$f":"IF(ISBLANK('FY25-26 Work Plan'!$I$19:$I$19),\"\",TEXT('FY25-26 Work Plan'!$I$19:$I$19,\"###-###-####\"))","v":"213-555-1213"},{"$f":"IF(ISBLANK('FY25-26 Work Plan'!$L$19:$L$19),\"\",'FY25-26 Work Plan'!$L$19:$L$19)","v":"j.doe@preventionusa.com"},{"$f":"IF(ISBLANK('FY25-26 Work Plan'!$E$23:$E$23),\"\",'FY25-26 Work Plan'!$E$23:$E$23)","v":""},{"$f":"IF(ISBLANK('FY25-26 Work Plan'!$I$23:$I$23),\"\",'FY25-26 Work Plan'!$I$23:$I$23)","v":""},{"$f":"IF(ISBLANK('FY25-26 Work Plan'!$E$24:$E$24),\"\",'FY25-26 Work Plan'!$E$24:$E$24)","v":""},{"$f":"IF(ISBLANK('FY25-26 Work Plan'!$I$24:$I$24),\"\",'FY25-26 Work Plan'!$I$24:$I$24)","v":""},{"$f":"IF(ISBLANK('FY25-26 Work Plan'!$E$25:$E$25),\"\",'FY25-26 Work Plan'!$E$25:$E$25)","v":""},{"$f":"IF(ISBLANK('FY25-26 Work Plan'!$I$25:$I$25),\"\",'FY25-26 Work Plan'!$I$25:$I$25)","v":""},{"$f":"IF(ISBLANK('FY25-26 Work Plan'!$E$26:$E$26),\"\",'FY25-26 Work Plan'!$E$26:$E$26)","v":""},{"$f":"IF(ISBLANK('FY25-26 Work Plan'!$I$26:$I$26),\"\",'FY25-26 Work Plan'!$I$26:$I$26)","v":""},{"$f":"IF(ISBLANK('FY25-26 Work Plan'!$E$27:$E$27),\"\",'FY25-26 Work Plan'!$E$27:$E$27)","v":""},{"$f":"IF(ISBLANK('FY25-26 Work Plan'!$I$27:$I$27),\"\",'FY25-26 Work Plan'!$I$27:$I$27)","v":""},{"$f":"IF(ISBLANK('FY25-26 Work Plan'!$E$28:$E$28),\"\",'FY25-26 Work Plan'!$E$28:$E$28)","v":""},{"$f":"IF(ISBLANK('FY25-26 Work Plan'!$I$28:$I$28),\"\",'FY25-26 Work Plan'!$I$28:$I$28)","v":""},{"$f":"IF(ISBLANK('FY25-26 Work Plan'!$E$29:$E$29),\"\",'FY25-26 Work Plan'!$E$29:$E$29)","v":""},{"$f":"IF(ISBLANK('FY25-26 Work Plan'!$I$29:$I$29),\"\",'FY25-26 Work Plan'!$I$29:$I$29)","v":""},{"$f":"IF(ISBLANK('FY25-26 Work Plan'!$B$30:$B$30),\"\",'FY25-26 Work Plan'!$B$30:$B$30)","v":""},{"$f":"IF(ISBLANK('FY25-26 Work Plan'!$E$30:$E$30),\"\",'FY25-26 Work Plan'!$E$30:$E$30)","v":""},{"$f":"IF(ISBLANK('FY25-26 Work Plan'!$I$30:$I$30),\"\",'FY25-26 Work Plan'!$I$30:$I$30)","v":""},{"$f":"IF(ISBLANK('FY25-26 Work Plan'!$B$31:$B$31),\"\",'FY25-26 Work Plan'!$B$31:$B$31)","v":""},{"$f":"IF(ISBLANK('FY25-26 Work Plan'!$E$31:$E$31),\"\",'FY25-26 Work Plan'!$E$31:$E$31)","v":""},{"$f":"IF(ISBLANK('FY25-26 Work Plan'!$I$31:$I$31),\"\",'FY25-26 Work Plan'!$I$31:$I$31)","v":""},{"$f":"IF(ISBLANK('FY25-26 Work Plan'!$B$32:$B$32),\"\",'FY25-26 Work Plan'!$B$32:$B$32)","v":""},{"$f":"IF(ISBLANK('FY25-26 Work Plan'!$E$32:$E$32),\"\",'FY25-26 Work Plan'!$E$32:$E$32)","v":""},{"$f":"IF(ISBLANK('FY25-26 Work Plan'!$I$32:$I$32),\"\",'FY25-26 Work Plan'!$I$32:$I$32)","v":""},{"$f":"IF(ISBLANK('FY25-26 Work Plan'!#REF!),\"\",'FY25-26 Work Plan'!#REF!)","v":{"$error":"#REF!"}},{"$f":"IF(ISBLANK('FY25-26 Work Plan'!#REF!),\"\",'FY25-26 Work Plan'!#REF!)","v":{"$error":"#REF!"}},{"$f":"IF(ISBLANK('FY25-26 Work Plan'!#REF!),\"\",'FY25-26 Work Plan'!#REF!)","v":{"$error":"#REF!"}},{"$f":"IF(ISBLANK('FY25-26 Work Plan'!#REF!),\"\",'FY25-26 Work Plan'!#REF!)","v":{"$error":"#REF!"}},{"$f":"IF(ISBLANK('FY25-26 Work Plan'!#REF!),\"\",'FY25-26 Work Plan'!#REF!)","v":{"$error":"#REF!"}},{"$f":"IF(ISBLANK('FY25-26 Work Plan'!#REF!),\"\",'FY25-26 Work Plan'!#REF!)","v":{"$error":"#REF!"}},{"$f":"IF(ISBLANK('FY25-26 Work Plan'!#REF!),\"\",'FY25-26 Work Plan'!#REF!)","v":{"$error":"#REF!"}},{"$f":"IF(ISBLANK('FY25-26 Work Plan'!#REF!),\"\",'FY25-26 Work Plan'!#REF!)","v":{"$error":"#REF!"}},{"$f":"IF(ISBLANK('FY25-26 Work Plan'!#REF!),\"\",'FY25-26 Work Plan'!#REF!)","v":{"$error":"#REF!"}}]
[{"$f":"IF(ISBLANK('FY25-26 Work Plan'!$E$2:$E$2),\"\",'FY25-26 Work Plan'!$E$2:$E$2)","v":"Asian American Drug Abuse Programs, Inc. (AADAP)"},{"$f":"IF(ISBLANK('FY25-26 Work Plan'!$L$2:$L$2),\"\",'FY25-26 Work Plan'!$L$2:$L$2)","v":"Prevention Education Program (PEP)"},{"$f":"IF(ISBLANK('FY25-26 Work Plan'!$L$3:$L$3),\"\",'FY25-26 Work Plan'!$L$3:$L$3)","v":""},{"$f":"IF(ISBLANK('FY25-26 Work Plan'!$E$3:$E$3),\"\",'FY25-26 Work Plan'!$E$3:$E$3)","v":"PH-005150 "},{"$f":"IF(ISBLANK('FY25-26 Work Plan'!$E$4:$E$4),\"\",TEXT('FY25-26 Work Plan'!$E$4:$E$4,\"000000\"))","v":"000001"},{"$f":"IF(ISBLANK('FY25-26 Work Plan'!$L$4:$L$4),\"\",'FY25-26 Work Plan'!$L$4:$L$4)","v":""},{"$f":"IF(ISBLANK('FY25-26 Work Plan'!$E$5:$E$5),\"\",'FY25-26 Work Plan'!$E$5:$E$5)","v":"2 - San Fernando Valley"},{"$f":"IF(ISBLANK('FY25-26 Work Plan'!$L$5:$L$5),\"\",'FY25-26 Work Plan'!$L$5:$L$5)","v":""},{"$f":"IF(ISBLANK('FY25-26 Work Plan'!$E$6:$E$6),\"\",'FY25-26 Work Plan'!$E$6:$E$6)","v":"Agoura Hills, Agua Dulce*"},{"$f":"IF(ISBLANK('FY25-26 Work Plan'!$F$7:$F$7),\"\",'FY25-26 Work Plan'!$F$7:$F$7)","v":""},{"$f":"IF(ISBLANK('FY25-26 Work Plan'!$F$8:$F$8),\"\",'FY25-26 Work Plan'!$F$8:$F$8)","v":""},{"$f":"IF(ISBLANK('FY25-26 Work Plan'!$E$9:$E$9),\"\",'FY25-26 Work Plan'!$E$9:$E$9)","v":"123 E Main St., Suite 100 \nAnytown, CA 90000"},{"$f":"IF(ISBLANK('FY25-26 Work Plan'!$L$9:$L$9),\"\",TEXT('FY25-26 Work Plan'!$L$9:$L$9,\"###-###-####\"))","v":"999-999-9999"},{"$f":"IF(ISBLANK('FY25-26 Work Plan'!$L$10:$L$10),\"\",'FY25-26 Work Plan'!$L$10:$L$10)","v":"www.abc1.org"},{"$f":"IF(ISBLANK('FY25-26 Work Plan'!$E$11:$E$11),\"\",'FY25-26 Work Plan'!$E$11:$E$11)","v":"123 E Main St., Suite 100 \nAnytown, CA 90000"},{"$f":"IF(ISBLANK('FY25-26 Work Plan'!$L$11:$L$11),\"\",TEXT('FY25-26 Work Plan'!$L$11:$L$11,\"###-###-####\"))","v":"999-999-9999"},{"$f":"IF(ISBLANK('FY25-26 Work Plan'!$L$12:$L$12),\"\",'FY25-26 Work Plan'!$L$12:$L$12)","v":"www.abc2.org"},{"$f":"IF(ISBLANK('FY25-26 Work Plan'!$E$15:$E$15),\"\",'FY25-26 Work Plan'!$E$15:$E$15)","v":"John/Jane Doe"},{"$f":"IF(ISBLANK('FY25-26 Work Plan'!$I$15:$I$15),\"\",TEXT('FY25-26 Work Plan'!$I$15:$I$15,\"###-###-####\"))","v":"213-555-1212"},{"$f":"IF(ISBLANK('FY25-26 Work Plan'!$L$15:$L$15),\"\",'FY25-26 Work Plan'!$L$15:$L$15)","v":"janedoe@preventionusa.com"},{"$f":"IF(ISBLANK('FY25-26 Work Plan'!$E$16:$E$16),\"\",'FY25-26 Work Plan'!$E$16:$E$16)","v":"John/Jane Doe"},{"$f":"IF(ISBLANK('FY25-26 Work Plan'!$I$16:$I$16),\"\",TEXT('FY25-26 Work Plan'!$I$16:$I$16,\"###-###-####\"))","v":"213-555-1212"},{"$f":"IF(ISBLANK('FY25-26 Work Plan'!$L$16:$L$16),\"\",'FY25-26 Work Plan'!$L$16:$L$16)","v":"janedoe@preventionusa.com"},{"$f":"IF(ISBLANK('FY25-26 Work Plan'!$E$17:$E$17),\"\",'FY25-26 Work Plan'!$E$17:$E$17)","v":"John/Jane Doe"},{"$f":"IF(ISBLANK('FY25-26 Work Plan'!$I$17:$I$17),\"\",TEXT('FY25-26 Work Plan'!$I$17:$I$17,\"###-###-####\"))","v":"213-555-1212"},{"$f":"IF(ISBLANK('FY25-26 Work Plan'!$L$17:$L$17),\"\",'FY25-26 Work Plan'!$L$17:$L$17)","v":"j.doe@preventionusa.com"},{"$f":"IF(ISBLANK('FY25-26 Work Plan'!$E$18:$E$18),\"\",'FY25-26 Work Plan'!$E$18:$E$18)","v":"John/Jane Doe"},{"$f":"IF(ISBLANK('FY25-26 Work Plan'!$I$18:$I$18),\"\",TEXT('FY25-26 Work Plan'!$I$18:$I$18,\"###-###-####\"))","v":"213-555-1213"},{"$f":"IF(ISBLANK('FY25-26 Work Plan'!$L$18:$L$18),\"\",'FY25-26 Work Plan'!$L$18:$L$18)","v":"j.doe@preventionusa.com"},{"$f":"IF(ISBLANK('FY25-26 Work Plan'!$E$19:$E$19),\"\",'FY25-26 Work Plan'!$E$19:$E$19)","v":"John/Jane Doe"},{"$f":"IF(ISBLANK('FY25-26 Work Plan'!$I$19:$I$19),\"\",TEXT('FY25-26 Work Plan'!$I$19:$I$19,\"###-###-####\"))","v":"213-555-1213"},{"$f":"IF(ISBLANK('FY25-26 Work Plan'!$L$19:$L$19),\"\",'FY25-26 Work Plan'!$L$19:$L$19)","v":"j.doe@preventionusa.com"},{"$f":"IF(ISBLANK('FY25-26 Work Plan'!$E$23:$E$23),\"\",'FY25-26 Work Plan'!$E$23:$E$23)","v":""},{"$f":"IF(ISBLANK('FY25-26 Work Plan'!$I$23:$I$23),\"\",'FY25-26 Work Plan'!$I$23:$I$23)","v":""},{"$f":"IF(ISBLANK('FY25-26 Work Plan'!$E$24:$E$24),\"\",'FY25-26 Work Plan'!$E$24:$E$24)","v":""},{"$f":"IF(ISBLANK('FY25-26 Work Plan'!$I$24:$I$24),\"\",'FY25-26 Work Plan'!$I$24:$I$24)","v":""},{"$f":"IF(ISBLANK('FY25-26 Work Plan'!$E$25:$E$25),\"\",'FY25-26 Work Plan'!$E$25:$E$25)","v":""},{"$f":"IF(ISBLANK('FY25-26 Work Plan'!$I$25:$I$25),\"\",'FY25-26 Work Plan'!$I$25:$I$25)","v":""},{"$f":"IF(ISBLANK('FY25-26 Work Plan'!$E$26:$E$26),\"\",'FY25-26 Work Plan'!$E$26:$E$26)","v":""},{"$f":"IF(ISBLANK('FY25-26 Work Plan'!$I$26:$I$26),\"\",'FY25-26 Work Plan'!$I$26:$I$26)","v":""},{"$f":"IF(ISBLANK('FY25-26 Work Plan'!$E$27:$E$27),\"\",'FY25-26 Work Plan'!$E$27:$E$27)","v":""},{"$f":"IF(ISBLANK('FY25-26 Work Plan'!$I$27:$I$27),\"\",'FY25-26 Work Plan'!$I$27:$I$27)","v":""},{"$f":"IF(ISBLANK('FY25-26 Work Plan'!$E$28:$E$28),\"\",'FY25-26 Work Plan'!$E$28:$E$28)","v":""},{"$f":"IF(ISBLANK('FY25-26 Work Plan'!$I$28:$I$28),\"\",'FY25-26 Work Plan'!$I$28:$I$28)","v":""},{"$f":"IF(ISBLANK('FY25-26 Work Plan'!$E$29:$E$29),\"\",'FY25-26 Work Plan'!$E$29:$E$29)","v":""},{"$f":"IF(ISBLANK('FY25-26 Work Plan'!$I$29:$I$29),\"\",'FY25-26 Work Plan'!$I$29:$I$29)","v":""},{"$f":"IF(ISBLANK('FY25-26 Work Plan'!$B$30:$B$30),\"\",'FY25-26 Work Plan'!$B$30:$B$30)","v":""},{"$f":"IF(ISBLANK('FY25-26 Work Plan'!$E$30:$E$30),\"\",'FY25-26 Work Plan'!$E$30:$E$30)","v":""},{"$f":"IF(ISBLANK('FY25-26 Work Plan'!$I$30:$I$30),\"\",'FY25-26 Work Plan'!$I$30:$I$30)","v":""},{"$f":"IF(ISBLANK('FY25-26 Work Plan'!$B$31:$B$31),\"\",'FY25-26 Work Plan'!$B$31:$B$31)","v":""},{"$f":"IF(ISBLANK('FY25-26 Work Plan'!$E$31:$E$31),\"\",'FY25-26 Work Plan'!$E$31:$E$31)","v":""},{"$f":"IF(ISBLANK('FY25-26 Work Plan'!$I$31:$I$31),\"\",'FY25-26 Work Plan'!$I$31:$I$31)","v":""},{"$f":"IF(ISBLANK('FY25-26 Work Plan'!$B$32:$B$32),\"\",'FY25-26 Work Plan'!$B$32:$B$32)","v":""},{"$f":"IF(ISBLANK('FY25-26 Work Plan'!$E$32:$E$32),\"\",'FY25-26 Work Plan'!$E$32:$E$32)","v":""},{"$f":"IF(ISBLANK('FY25-26 Work Plan'!$I$32:$I$32),\"\",'FY25-26 Work Plan'!$I$32:$I$32)","v":""},{"$f":"IF(ISBLANK('FY25-26 Work Plan'!#REF!),\"\",'FY25-26 Work Plan'!#REF!)","v":{"$error":"#REF!"}},{"$f":"IF(ISBLANK('FY25-26 Work Plan'!#REF!),\"\",'FY25-26 Work Plan'!#REF!)","v":{"$error":"#REF!"}},{"$f":"IF(ISBLANK('FY25-26 Work Plan'!#REF!),\"\",'FY25-26 Work Plan'!#REF!)","v":{"$error":"#REF!"}},{"$f":"IF(ISBLANK('FY25-26 Work Plan'!#REF!),\"\",'FY25-26 Work Plan'!#REF!)","v":{"$error":"#REF!"}},{"$f":"IF(ISBLANK('FY25-26 Work Plan'!#REF!),\"\",'FY25-26 Work Plan'!#REF!)","v":{"$error":"#REF!"}},{"$f":"IF(ISBLANK('FY25-26 Work Plan'!#REF!),\"\",'FY25-26 Work Plan'!#REF!)","v":{"$error":"#REF!"}},{"$f":"IF(ISBLANK('FY25-26 Work Plan'!#REF!),\"\",'FY25-26 Work Plan'!#REF!)","v":{"$error":"#REF!"}},{"$f":"IF(ISBLANK('FY25-26 Work Plan'!#REF!),\"\",'FY25-26 Work Plan'!#REF!)","v":{"$error":"#REF!"}},{"$f":"IF(ISBLANK('FY25-26 Work Plan'!#REF!),\"\",'FY25-26 Work Plan'!#REF!)","v":{"$error":"#REF!"}}]
[{"$f":"IF(ISBLANK('FY25-26 Work Plan'!$E$2:$E$2),\"\",'FY25-26 Work Plan'!$E$2:$E$2)","v":"Asian American Drug Abuse Programs, Inc. (AADAP)"},{"$f":"IF(ISBLANK('FY25-26 Work Plan'!$L$2:$L$2),\"\",'FY25-26 Work Plan'!$L$2:$L$2)","v":"Prevention Education Program (PEP)"},{"$f":"IF(ISBLANK('FY25-26 Work Plan'!$L$3:$L$3),\"\",'FY25-26 Work Plan'!$L$3:$L$3)","v":""},{"$f":"IF(ISBLANK('FY25-26 Work Plan'!$E$3:$E$3),\"\",'FY25-26 Work Plan'!$E$3:$E$3)","v":"PH-005150 "},{"$f":"IF(ISBLANK('FY25-26 Work Plan'!$E$4:$E$4),\"\",TEXT('FY25-26 Work Plan'!$E$4:$E$4,\"000000\"))","v":"000001"},{"$f":"IF(ISBLANK('FY25-26 Work Plan'!$L$4:$L$4),\"\",'FY25-26 Work Plan'!$L$4:$L$4)","v":""},{"$f":"IF(ISBLANK('FY25-26 Work Plan'!$E$5:$E$5),\"\",'FY25-26 Work Plan'!$E$5:$E$5)","v":"2 - San Fernando Valley"},{"$f":"IF(ISBLANK('FY25-26 Work Plan'!$L$5:$L$5),\"\",'FY25-26 Work Plan'!$L$5:$L$5)","v":""},{"$f":"IF(ISBLANK('FY25-26 Work Plan'!$E$6:$E$6),\"\",'FY25-26 Work Plan'!$E$6:$E$6)","v":"Agoura Hills, Agua Dulce*"},{"$f":"IF(ISBLANK('FY25-26 Work Plan'!$F$7:$F$7),\"\",'FY25-26 Work Plan'!$F$7:$F$7)","v":""},{"$f":"IF(ISBLANK('FY25-26 Work Plan'!$F$8:$F$8),\"\",'FY25-26 Work Plan'!$F$8:$F$8)","v":""},{"$f":"IF(ISBLANK('FY25-26 Work Plan'!$E$9:$E$9),\"\",'FY25-26 Work Plan'!$E$9:$E$9)","v":"123 E Main St., Suite 100 \nAnytown, CA 90000"},{"$f":"IF(ISBLANK('FY25-26 Work Plan'!$L$9:$L$9),\"\",TEXT('FY25-26 Work Plan'!$L$9:$L$9,\"###-###-####\"))","v":"999-999-9999"},{"$f":"IF(ISBLANK('FY25-26 Work Plan'!$L$10:$L$10),\"\",'FY25-26 Work Plan'!$L$10:$L$10)","v":"www.abc1.org"},{"$f":"IF(ISBLANK('FY25-26 Work Plan'!$E$11:$E$11),\"\",'FY25-26 Work Plan'!$E$11:$E$11)","v":"123 E Main St., Suite 100 \nAnytown, CA 90000"},{"$f":"IF(ISBLANK('FY25-26 Work Plan'!$L$11:$L$11),\"\",TEXT('FY25-26 Work Plan'!$L$11:$L$11,\"###-###-####\"))","v":"999-999-9999"},{"$f":"IF(ISBLANK('FY25-26 Work Plan'!$L$12:$L$12),\"\",'FY25-26 Work Plan'!$L$12:$L$12)","v":"www.abc2.org"},{"$f":"IF(ISBLANK('FY25-26 Work Plan'!$E$15:$E$15),\"\",'FY25-26 Work Plan'!$E$15:$E$15)","v":"John/Jane Doe"},{"$f":"IF(ISBLANK('FY25-26 Work Plan'!$I$15:$I$15),\"\",TEXT('FY25-26 Work Plan'!$I$15:$I$15,\"###-###-####\"))","v":"213-555-1212"},{"$f":"IF(ISBLANK('FY25-26 Work Plan'!$L$15:$L$15),\"\",'FY25-26 Work Plan'!$L$15:$L$15)","v":"janedoe@preventionusa.com"},{"$f":"IF(ISBLANK('FY25-26 Work Plan'!$E$16:$E$16),\"\",'FY25-26 Work Plan'!$E$16:$E$16)","v":"John/Jane Doe"},{"$f":"IF(ISBLANK('FY25-26 Work Plan'!$I$16:$I$16),\"\",TEXT('FY25-26 Work Plan'!$I$16:$I$16,\"###-###-####\"))","v":"213-555-1212"},{"$f":"IF(ISBLANK('FY25-26 Work Plan'!$L$16:$L$16),\"\",'FY25-26 Work Plan'!$L$16:$L$16)","v":"janedoe@preventionusa.com"},{"$f":"IF(ISBLANK('FY25-26 Work Plan'!$E$17:$E$17),\"\",'FY25-26 Work Plan'!$E$17:$E$17)","v":"John/Jane Doe"},{"$f":"IF(ISBLANK('FY25-26 Work Plan'!$I$17:$I$17),\"\",TEXT('FY25-26 Work Plan'!$I$17:$I$17,\"###-###-####\"))","v":"213-555-1212"},{"$f":"IF(ISBLANK('FY25-26 Work Plan'!$L$17:$L$17),\"\",'FY25-26 Work Plan'!$L$17:$L$17)","v":"j.doe@preventionusa.com"},{"$f":"IF(ISBLANK('FY25-26 Work Plan'!$E$18:$E$18),\"\",'FY25-26 Work Plan'!$E$18:$E$18)","v":"John/Jane Doe"},{"$f":"IF(ISBLANK('FY25-26 Work Plan'!$I$18:$I$18),\"\",TEXT('FY25-26 Work Plan'!$I$18:$I$18,\"###-###-####\"))","v":"213-555-1213"},{"$f":"IF(ISBLANK('FY25-26 Work Plan'!$L$18:$L$18),\"\",'FY25-26 Work Plan'!$L$18:$L$18)","v":"j.doe@preventionusa.com"},{"$f":"IF(ISBLANK('FY25-26 Work Plan'!$E$19:$E$19),\"\",'FY25-26 Work Plan'!$E$19:$E$19)","v":"John/Jane Doe"},{"$f":"IF(ISBLANK('FY25-26 Work Plan'!$I$19:$I$19),\"\",TEXT('FY25-26 Work Plan'!$I$19:$I$19,\"###-###-####\"))","v":"213-555-1213"},{"$f":"IF(ISBLANK('FY25-26 Work Plan'!$L$19:$L$19),\"\",'FY25-26 Work Plan'!$L$19:$L$19)","v":"j.doe@preventionusa.com"},{"$f":"IF(ISBLANK('FY25-26 Work Plan'!$E$23:$E$23),\"\",'FY25-26 Work Plan'!$E$23:$E$23)","v":""},{"$f":"IF(ISBLANK('FY25-26 Work Plan'!$I$23:$I$23),\"\",'FY25-26 Work Plan'!$I$23:$I$23)","v":""},{"$f":"IF(ISBLANK('FY25-26 Work Plan'!$E$24:$E$24),\"\",'FY25-26 Work Plan'!$E$24:$E$24)","v":""},{"$f":"IF(ISBLANK('FY25-26 Work Plan'!$I$24:$I$24),\"\",'FY25-26 Work Plan'!$I$24:$I$24)","v":""},{"$f":"IF(ISBLANK('FY25-26 Work Plan'!$E$25:$E$25),\"\",'FY25-26 Work Plan'!$E$25:$E$25)","v":""},{"$f":"IF(ISBLANK('FY25-26 Work Plan'!$I$25:$I$25),\"\",'FY25-26 Work Plan'!$I$25:$I$25)","v":""},{"$f":"IF(ISBLANK('FY25-26 Work Plan'!$E$26:$E$26),\"\",'FY25-26 Work Plan'!$E$26:$E$26)","v":""},{"$f":"IF(ISBLANK('FY25-26 Work Plan'!$I$26:$I$26),\"\",'FY25-26 Work Plan'!$I$26:$I$26)","v":""},{"$f":"IF(ISBLANK('FY25-26 Work Plan'!$E$27:$E$27),\"\",'FY25-26 Work Plan'!$E$27:$E$27)","v":""},{"$f":"IF(ISBLANK('FY25-26 Work Plan'!$I$27:$I$27),\"\",'FY25-26 Work Plan'!$I$27:$I$27)","v":""},{"$f":"IF(ISBLANK('FY25-26 Work Plan'!$E$28:$E$28),\"\",'FY25-26 Work Plan'!$E$28:$E$28)","v":""},{"$f":"IF(ISBLANK('FY25-26 Work Plan'!$I$28:$I$28),\"\",'FY25-26 Work Plan'!$I$28:$I$28)","v":""},{"$f":"IF(ISBLANK('FY25-26 Work Plan'!$E$29:$E$29),\"\",'FY25-26 Work Plan'!$E$29:$E$29)","v":""},{"$f":"IF(ISBLANK('FY25-26 Work Plan'!$I$29:$I$29),\"\",'FY25-26 Work Plan'!$I$29:$I$29)","v":""},{"$f":"IF(ISBLANK('FY25-26 Work Plan'!$B$30:$B$30),\"\",'FY25-26 Work Plan'!$B$30:$B$30)","v":""},{"$f":"IF(ISBLANK('FY25-26 Work Plan'!$E$30:$E$30),\"\",'FY25-26 Work Plan'!$E$30:$E$30)","v":""},{"$f":"IF(ISBLANK('FY25-26 Work Plan'!$I$30:$I$30),\"\",'FY25-26 Work Plan'!$I$30:$I$30)","v":""},{"$f":"IF(ISBLANK('FY25-26 Work Plan'!$B$31:$B$31),\"\",'FY25-26 Work Plan'!$B$31:$B$31)","v":""},{"$f":"IF(ISBLANK('FY25-26 Work Plan'!$E$31:$E$31),\"\",'FY25-26 Work Plan'!$E$31:$E$31)","v":""},{"$f":"IF(ISBLANK('FY25-26 Work Plan'!$I$31:$I$31),\"\",'FY25-26 Work Plan'!$I$31:$I$31)","v":""},{"$f":"IF(ISBLANK('FY25-26 Work Plan'!$B$32:$B$32),\"\",'FY25-26 Work Plan'!$B$32:$B$32)","v":""},{"$f":"IF(ISBLANK('FY25-26 Work Plan'!$E$32:$E$32),\"\",'FY25-26 Work Plan'!$E$32:$E$32)","v":""},{"$f":"IF(ISBLANK('FY25-26 Work Plan'!$I$32:$I$32),\"\",'FY25-26 Work Plan'!$I$32:$I$32)","v":""},{"$f":"IF(ISBLANK('FY25-26 Work Plan'!#REF!),\"\",'FY25-26 Work Plan'!#REF!)","v":{"$error":"#REF!"}},{"$f":"IF(ISBLANK('FY25-26 Work Plan'!#REF!),\"\",'FY25-26 Work Plan'!#REF!)","v":{"$error":"#REF!"}},{"$f":"IF(ISBLANK('FY25-26 Work Plan'!#REF!),\"\",'FY25-26 Work Plan'!#REF!)","v":{"$error":"#REF!"}},{"$f":"IF(ISBLANK('FY25-26 Work Plan'!#REF!),\"\",'FY25-26 Work Plan'!#REF!)","v":{"$error":"#REF!"}},{"$f":"IF(ISBLANK('FY25-26 Work Plan'!#REF!),\"\",'FY25-26 Work Plan'!#REF!)","v":{"$error":"#REF!"}},{"$f":"IF(ISBLANK('FY25-26 Work Plan'!#REF!),\"\",'FY25-26 Work Plan'!#REF!)","v":{"$error":"#REF!"}},{"$f":"IF(ISBLANK('FY25-26 Work Plan'!#REF!),\"\",'FY25-26 Work Plan'!#REF!)","v":{"$error":"#REF!"}},{"$f":"IF(ISBLANK('FY25-26 Work Plan'!#REF!),\"\",'FY25-26 Work Plan'!#REF!)","v":{"$error":"#REF!"}},{"$f":"IF(ISBLANK('FY25-26 Work Plan'!#REF!),\"\",'FY25-26 Work Plan'!#REF!)","v":{"$error":"#REF!"}}]
[{"$f":"IF(ISBLANK('FY25-26 Work Plan'!$E$2:$E$2),\"\",'FY25-26 Work Plan'!$E$2:$E$2)","v":"Asian American Drug Abuse Programs, Inc. (AADAP)"},{"$f":"IF(ISBLANK('FY25-26 Work Plan'!$L$2:$L$2),\"\",'FY25-26 Work Plan'!$L$2:$L$2)","v":"Prevention Education Program (PEP)"},{"$f":"IF(ISBLANK('FY25-26 Work Plan'!$L$3:$L$3),\"\",'FY25-26 Work Plan'!$L$3:$L$3)","v":""},{"$f":"IF(ISBLANK('FY25-26 Work Plan'!$E$3:$E$3),\"\",'FY25-26 Work Plan'!$E$3:$E$3)","v":"PH-005150 "},{"$f":"IF(ISBLANK('FY25-26 Work Plan'!$E$4:$E$4),\"\",TEXT('FY25-26 Work Plan'!$E$4:$E$4,\"000000\"))","v":"000001"},{"$f":"IF(ISBLANK('FY25-26 Work Plan'!$L$4:$L$4),\"\",'FY25-26 Work Plan'!$L$4:$L$4)","v":""},{"$f":"IF(ISBLANK('FY25-26 Work Plan'!$E$5:$E$5),\"\",'FY25-26 Work Plan'!$E$5:$E$5)","v":"2 - San Fernando Valley"},{"$f":"IF(ISBLANK('FY25-26 Work Plan'!$L$5:$L$5),\"\",'FY25-26 Work Plan'!$L$5:$L$5)","v":""},{"$f":"IF(ISBLANK('FY25-26 Work Plan'!$E$6:$E$6),\"\",'FY25-26 Work Plan'!$E$6:$E$6)","v":"Agoura Hills, Agua Dulce*"},{"$f":"IF(ISBLANK('FY25-26 Work Plan'!$F$7:$F$7),\"\",'FY25-26 Work Plan'!$F$7:$F$7)","v":""},{"$f":"IF(ISBLANK('FY25-26 Work Plan'!$F$8:$F$8),\"\",'FY25-26 Work Plan'!$F$8:$F$8)","v":""},{"$f":"IF(ISBLANK('FY25-26 Work Plan'!$E$9:$E$9),\"\",'FY25-26 Work Plan'!$E$9:$E$9)","v":"123 E Main St., Suite 100 \nAnytown, CA 90000"},{"$f":"IF(ISBLANK('FY25-26 Work Plan'!$L$9:$L$9),\"\",TEXT('FY25-26 Work Plan'!$L$9:$L$9,\"###-###-####\"))","v":"999-999-9999"},{"$f":"IF(ISBLANK('FY25-26 Work Plan'!$L$10:$L$10),\"\",'FY25-26 Work Plan'!$L$10:$L$10)","v":"www.abc1.org"},{"$f":"IF(ISBLANK('FY25-26 Work Plan'!$E$11:$E$11),\"\",'FY25-26 Work Plan'!$E$11:$E$11)","v":"123 E Main St., Suite 100 \nAnytown, CA 90000"},{"$f":"IF(ISBLANK('FY25-26 Work Plan'!$L$11:$L$11),\"\",TEXT('FY25-26 Work Plan'!$L$11:$L$11,\"###-###-####\"))","v":"999-999-9999"},{"$f":"IF(ISBLANK('FY25-26 Work Plan'!$L$12:$L$12),\"\",'FY25-26 Work Plan'!$L$12:$L$12)","v":"www.abc2.org"},{"$f":"IF(ISBLANK('FY25-26 Work Plan'!$E$15:$E$15),\"\",'FY25-26 Work Plan'!$E$15:$E$15)","v":"John/Jane Doe"},{"$f":"IF(ISBLANK('FY25-26 Work Plan'!$I$15:$I$15),\"\",TEXT('FY25-26 Work Plan'!$I$15:$I$15,\"###-###-####\"))","v":"213-555-1212"},{"$f":"IF(ISBLANK('FY25-26 Work Plan'!$L$15:$L$15),\"\",'FY25-26 Work Plan'!$L$15:$L$15)","v":"janedoe@preventionusa.com"},{"$f":"IF(ISBLANK('FY25-26 Work Plan'!$E$16:$E$16),\"\",'FY25-26 Work Plan'!$E$16:$E$16)","v":"John/Jane Doe"},{"$f":"IF(ISBLANK('FY25-26 Work Plan'!$I$16:$I$16),\"\",TEXT('FY25-26 Work Plan'!$I$16:$I$16,\"###-###-####\"))","v":"213-555-1212"},{"$f":"IF(ISBLANK('FY25-26 Work Plan'!$L$16:$L$16),\"\",'FY25-26 Work Plan'!$L$16:$L$16)","v":"janedoe@preventionusa.com"},{"$f":"IF(ISBLANK('FY25-26 Work Plan'!$E$17:$E$17),\"\",'FY25-26 Work Plan'!$E$17:$E$17)","v":"John/Jane Doe"},{"$f":"IF(ISBLANK('FY25-26 Work Plan'!$I$17:$I$17),\"\",TEXT('FY25-26 Work Plan'!$I$17:$I$17,\"###-###-####\"))","v":"213-555-1212"},{"$f":"IF(ISBLANK('FY25-26 Work Plan'!$L$17:$L$17),\"\",'FY25-26 Work Plan'!$L$17:$L$17)","v":"j.doe@preventionusa.com"},{"$f":"IF(ISBLANK('FY25-26 Work Plan'!$E$18:$E$18),\"\",'FY25-26 Work Plan'!$E$18:$E$18)","v":"John/Jane Doe"},{"$f":"IF(ISBLANK('FY25-26 Work Plan'!$I$18:$I$18),\"\",TEXT('FY25-26 Work Plan'!$I$18:$I$18,\"###-###-####\"))","v":"213-555-1213"},{"$f":"IF(ISBLANK('FY25-26 Work Plan'!$L$18:$L$18),\"\",'FY25-26 Work Plan'!$L$18:$L$18)","v":"j.doe@preventionusa.com"},{"$f":"IF(ISBLANK('FY25-26 Work Plan'!$E$19:$E$19),\"\",'FY25-26 Work Plan'!$E$19:$E$19)","v":"John/Jane Doe"},{"$f":"IF(ISBLANK('FY25-26 Work Plan'!$I$19:$I$19),\"\",TEXT('FY25-26 Work Plan'!$I$19:$I$19,\"###-###-####\"))","v":"213-555-1213"},{"$f":"IF(ISBLANK('FY25-26 Work Plan'!$L$19:$L$19),\"\",'FY25-26 Work Plan'!$L$19:$L$19)","v":"j.doe@preventionusa.com"},{"$f":"IF(ISBLANK('FY25-26 Work Plan'!$E$23:$E$23),\"\",'FY25-26 Work Plan'!$E$23:$E$23)","v":""},{"$f":"IF(ISBLANK('FY25-26 Work Plan'!$I$23:$I$23),\"\",'FY25-26 Work Plan'!$I$23:$I$23)","v":""},{"$f":"IF(ISBLANK('FY25-26 Work Plan'!$E$24:$E$24),\"\",'FY25-26 Work Plan'!$E$24:$E$24)","v":""},{"$f":"IF(ISBLANK('FY25-26 Work Plan'!$I$24:$I$24),\"\",'FY25-26 Work Plan'!$I$24:$I$24)","v":""},{"$f":"IF(ISBLANK('FY25-26 Work Plan'!$E$25:$E$25),\"\",'FY25-26 Work Plan'!$E$25:$E$25)","v":""},{"$f":"IF(ISBLANK('FY25-26 Work Plan'!$I$25:$I$25),\"\",'FY25-26 Work Plan'!$I$25:$I$25)","v":""},{"$f":"IF(ISBLANK('FY25-26 Work Plan'!$E$26:$E$26),\"\",'FY25-26 Work Plan'!$E$26:$E$26)","v":""},{"$f":"IF(ISBLANK('FY25-26 Work Plan'!$I$26:$I$26),\"\",'FY25-26 Work Plan'!$I$26:$I$26)","v":""},{"$f":"IF(ISBLANK('FY25-26 Work Plan'!$E$27:$E$27),\"\",'FY25-26 Work Plan'!$E$27:$E$27)","v":""},{"$f":"IF(ISBLANK('FY25-26 Work Plan'!$I$27:$I$27),\"\",'FY25-26 Work Plan'!$I$27:$I$27)","v":""},{"$f":"IF(ISBLANK('FY25-26 Work Plan'!$E$28:$E$28),\"\",'FY25-26 Work Plan'!$E$28:$E$28)","v":""},{"$f":"IF(ISBLANK('FY25-26 Work Plan'!$I$28:$I$28),\"\",'FY25-26 Work Plan'!$I$28:$I$28)","v":""},{"$f":"IF(ISBLANK('FY25-26 Work Plan'!$E$29:$E$29),\"\",'FY25-26 Work Plan'!$E$29:$E$29)","v":""},{"$f":"IF(ISBLANK('FY25-26 Work Plan'!$I$29:$I$29),\"\",'FY25-26 Work Plan'!$I$29:$I$29)","v":""},{"$f":"IF(ISBLANK('FY25-26 Work Plan'!$B$30:$B$30),\"\",'FY25-26 Work Plan'!$B$30:$B$30)","v":""},{"$f":"IF(ISBLANK('FY25-26 Work Plan'!$E$30:$E$30),\"\",'FY25-26 Work Plan'!$E$30:$E$30)","v":""},{"$f":"IF(ISBLANK('FY25-26 Work Plan'!$I$30:$I$30),\"\",'FY25-26 Work Plan'!$I$30:$I$30)","v":""},{"$f":"IF(ISBLANK('FY25-26 Work Plan'!$B$31:$B$31),\"\",'FY25-26 Work Plan'!$B$31:$B$31)","v":""},{"$f":"IF(ISBLANK('FY25-26 Work Plan'!$E$31:$E$31),\"\",'FY25-26 Work Plan'!$E$31:$E$31)","v":""},{"$f":"IF(ISBLANK('FY25-26 Work Plan'!$I$31:$I$31),\"\",'FY25-26 Work Plan'!$I$31:$I$31)","v":""},{"$f":"IF(ISBLANK('FY25-26 Work Plan'!$B$32:$B$32),\"\",'FY25-26 Work Plan'!$B$32:$B$32)","v":""},{"$f":"IF(ISBLANK('FY25-26 Work Plan'!$E$32:$E$32),\"\",'FY25-26 Work Plan'!$E$32:$E$32)","v":""},{"$f":"IF(ISBLANK('FY25-26 Work Plan'!$I$32:$I$32),\"\",'FY25-26 Work Plan'!$I$32:$I$32)","v":""},{"$f":"IF(ISBLANK('FY25-26 Work Plan'!#REF!),\"\",'FY25-26 Work Plan'!#REF!)","v":{"$error":"#REF!"}},{"$f":"IF(ISBLANK('FY25-26 Work Plan'!#REF!),\"\",'FY25-26 Work Plan'!#REF!)","v":{"$error":"#REF!"}},{"$f":"IF(ISBLANK('FY25-26 Work Plan'!#REF!),\"\",'FY25-26 Work Plan'!#REF!)","v":{"$error":"#REF!"}},{"$f":"IF(ISBLANK('FY25-26 Work Plan'!#REF!),\"\",'FY25-26 Work Plan'!#REF!)","v":{"$error":"#REF!"}},{"$f":"IF(ISBLANK('FY25-26 Work Plan'!#REF!),\"\",'FY25-26 Work Plan'!#REF!)","v":{"$error":"#REF!"}},{"$f":"IF(ISBLANK('FY25-26 Work Plan'!#REF!),\"\",'FY25-26 Work Plan'!#REF!)","v":{"$error":"#REF!"}},{"$f":"IF(ISBLANK('FY25-26 Work Plan'!#REF!),\"\",'FY25-26 Work Plan'!#REF!)","v":{"$error":"#REF!"}},{"$f":"IF(ISBLANK('FY25-26 Work Plan'!#REF!),\"\",'FY25-26 Work Plan'!#REF!)","v":{"$error":"#REF!"}},{"$f":"IF(ISBLANK('FY25-26 Work Plan'!#REF!),\"\",'FY25-26 Work Plan'!#REF!)","v":{"$error":"#REF!"}}]
[{"$f":"IF(ISBLANK('FY25-26 Work Plan'!$E$2:$E$2),\"\",'FY25-26 Work Plan'!$E$2:$E$2)","v":"Asian American Drug Abuse Programs, Inc. (AADAP)"},{"$f":"IF(ISBLANK('FY25-26 Work Plan'!$L$2:$L$2),\"\",'FY25-26 Work Plan'!$L$2:$L$2)","v":"Prevention Education Program (PEP)"},{"$f":"IF(ISBLANK('FY25-26 Work Plan'!$L$3:$L$3),\"\",'FY25-26 Work Plan'!$L$3:$L$3)","v":""},{"$f":"IF(ISBLANK('FY25-26 Work Plan'!$E$3:$E$3),\"\",'FY25-26 Work Plan'!$E$3:$E$3)","v":"PH-005150 "},{"$f":"IF(ISBLANK('FY25-26 Work Plan'!$E$4:$E$4),\"\",TEXT('FY25-26 Work Plan'!$E$4:$E$4,\"000000\"))","v":"000001"},{"$f":"IF(ISBLANK('FY25-26 Work Plan'!$L$4:$L$4),\"\",'FY25-26 Work Plan'!$L$4:$L$4)","v":""},{"$f":"IF(ISBLANK('FY25-26 Work Plan'!$E$5:$E$5),\"\",'FY25-26 Work Plan'!$E$5:$E$5)","v":"2 - San Fernando Valley"},{"$f":"IF(ISBLANK('FY25-26 Work Plan'!$L$5:$L$5),\"\",'FY25-26 Work Plan'!$L$5:$L$5)","v":""},{"$f":"IF(ISBLANK('FY25-26 Work Plan'!$E$6:$E$6),\"\",'FY25-26 Work Plan'!$E$6:$E$6)","v":"Agoura Hills, Agua Dulce*"},{"$f":"IF(ISBLANK('FY25-26 Work Plan'!$F$7:$F$7),\"\",'FY25-26 Work Plan'!$F$7:$F$7)","v":""},{"$f":"IF(ISBLANK('FY25-26 Work Plan'!$F$8:$F$8),\"\",'FY25-26 Work Plan'!$F$8:$F$8)","v":""},{"$f":"IF(ISBLANK('FY25-26 Work Plan'!$E$9:$E$9),\"\",'FY25-26 Work Plan'!$E$9:$E$9)","v":"123 E Main St., Suite 100 \nAnytown, CA 90000"},{"$f":"IF(ISBLANK('FY25-26 Work Plan'!$L$9:$L$9),\"\",TEXT('FY25-26 Work Plan'!$L$9:$L$9,\"###-###-####\"))","v":"999-999-9999"},{"$f":"IF(ISBLANK('FY25-26 Work Plan'!$L$10:$L$10),\"\",'FY25-26 Work Plan'!$L$10:$L$10)","v":"www.abc1.org"},{"$f":"IF(ISBLANK('FY25-26 Work Plan'!$E$11:$E$11),\"\",'FY25-26 Work Plan'!$E$11:$E$11)","v":"123 E Main St., Suite 100 \nAnytown, CA 90000"},{"$f":"IF(ISBLANK('FY25-26 Work Plan'!$L$11:$L$11),\"\",TEXT('FY25-26 Work Plan'!$L$11:$L$11,\"###-###-####\"))","v":"999-999-9999"},{"$f":"IF(ISBLANK('FY25-26 Work Plan'!$L$12:$L$12),\"\",'FY25-26 Work Plan'!$L$12:$L$12)","v":"www.abc2.org"},{"$f":"IF(ISBLANK('FY25-26 Work Plan'!$E$15:$E$15),\"\",'FY25-26 Work Plan'!$E$15:$E$15)","v":"John/Jane Doe"},{"$f":"IF(ISBLANK('FY25-26 Work Plan'!$I$15:$I$15),\"\",TEXT('FY25-26 Work Plan'!$I$15:$I$15,\"###-###-####\"))","v":"213-555-1212"},{"$f":"IF(ISBLANK('FY25-26 Work Plan'!$L$15:$L$15),\"\",'FY25-26 Work Plan'!$L$15:$L$15)","v":"janedoe@preventionusa.com"},{"$f":"IF(ISBLANK('FY25-26 Work Plan'!$E$16:$E$16),\"\",'FY25-26 Work Plan'!$E$16:$E$16)","v":"John/Jane Doe"},{"$f":"IF(ISBLANK('FY25-26 Work Plan'!$I$16:$I$16),\"\",TEXT('FY25-26 Work Plan'!$I$16:$I$16,\"###-###-####\"))","v":"213-555-1212"},{"$f":"IF(ISBLANK('FY25-26 Work Plan'!$L$16:$L$16),\"\",'FY25-26 Work Plan'!$L$16:$L$16)","v":"janedoe@preventionusa.com"},{"$f":"IF(ISBLANK('FY25-26 Work Plan'!$E$17:$E$17),\"\",'FY25-26 Work Plan'!$E$17:$E$17)","v":"John/Jane Doe"},{"$f":"IF(ISBLANK('FY25-26 Work Plan'!$I$17:$I$17),\"\",TEXT('FY25-26 Work Plan'!$I$17:$I$17,\"###-###-####\"))","v":"213-555-1212"},{"$f":"IF(ISBLANK('FY25-26 Work Plan'!$L$17:$L$17),\"\",'FY25-26 Work Plan'!$L$17:$L$17)","v":"j.doe@preventionusa.com"},{"$f":"IF(ISBLANK('FY25-26 Work Plan'!$E$18:$E$18),\"\",'FY25-26 Work Plan'!$E$18:$E$18)","v":"John/Jane Doe"},{"$f":"IF(ISBLANK('FY25-26 Work Plan'!$I$18:$I$18),\"\",TEXT('FY25-26 Work Plan'!$I$18:$I$18,\"###-###-####\"))","v":"213-555-1213"},{"$f":"IF(ISBLANK('FY25-26 Work Plan'!$L$18:$L$18),\"\",'FY25-26 Work Plan'!$L$18:$L$18)","v":"j.doe@preventionusa.com"},{"$f":"IF(ISBLANK('FY25-26 Work Plan'!$E$19:$E$19),\"\",'FY25-26 Work Plan'!$E$19:$E$19)","v":"John/Jane Doe"},{"$f":"IF(ISBLANK('FY25-26 Work Plan'!$I$19:$I$19),\"\",TEXT('FY25-26 Work Plan'!$I$19:$I$19,\"###-###-####\"))","v":"213-555-1213"},{"$f":"IF(ISBLANK('FY25-26 Work Plan'!$L$19:$L$19),\"\",'FY25-26 Work Plan'!$L$19:$L$19)","v":"j.doe@preventionusa.com"},{"$f":"IF(ISBLANK('FY25-26 Work Plan'!$E$23:$E$23),\"\",'FY25-26 Work Plan'!$E$23:$E$23)","v":""},{"$f":"IF(ISBLANK('FY25-26 Work Plan'!$I$23:$I$23),\"\",'FY25-26 Work Plan'!$I$23:$I$23)","v":""},{"$f":"IF(ISBLANK('FY25-26 Work Plan'!$E$24:$E$24),\"\",'FY25-26 Work Plan'!$E$24:$E$24)","v":""},{"$f":"IF(ISBLANK('FY25-26 Work Plan'!$I$24:$I$24),\"\",'FY25-26 Work Plan'!$I$24:$I$24)","v":""},{"$f":"IF(ISBLANK('FY25-26 Work Plan'!$E$25:$E$25),\"\",'FY25-26 Work Plan'!$E$25:$E$25)","v":""},{"$f":"IF(ISBLANK('FY25-26 Work Plan'!$I$25:$I$25),\"\",'FY25-26 Work Plan'!$I$25:$I$25)","v":""},{"$f":"IF(ISBLANK('FY25-26 Work Plan'!$E$26:$E$26),\"\",'FY25-26 Work Plan'!$E$26:$E$26)","v":""},{"$f":"IF(ISBLANK('FY25-26 Work Plan'!$I$26:$I$26),\"\",'FY25-26 Work Plan'!$I$26:$I$26)","v":""},{"$f":"IF(ISBLANK('FY25-26 Work Plan'!$E$27:$E$27),\"\",'FY25-26 Work Plan'!$E$27:$E$27)","v":""},{"$f":"IF(ISBLANK('FY25-26 Work Plan'!$I$27:$I$27),\"\",'FY25-26 Work Plan'!$I$27:$I$27)","v":""},{"$f":"IF(ISBLANK('FY25-26 Work Plan'!$E$28:$E$28),\"\",'FY25-26 Work Plan'!$E$28:$E$28)","v":""},{"$f":"IF(ISBLANK('FY25-26 Work Plan'!$I$28:$I$28),\"\",'FY25-26 Work Plan'!$I$28:$I$28)","v":""},{"$f":"IF(ISBLANK('FY25-26 Work Plan'!$E$29:$E$29),\"\",'FY25-26 Work Plan'!$E$29:$E$29)","v":""},{"$f":"IF(ISBLANK('FY25-26 Work Plan'!$I$29:$I$29),\"\",'FY25-26 Work Plan'!$I$29:$I$29)","v":""},{"$f":"IF(ISBLANK('FY25-26 Work Plan'!$B$30:$B$30),\"\",'FY25-26 Work Plan'!$B$30:$B$30)","v":""},{"$f":"IF(ISBLANK('FY25-26 Work Plan'!$E$30:$E$30),\"\",'FY25-26 Work Plan'!$E$30:$E$30)","v":""},{"$f":"IF(ISBLANK('FY25-26 Work Plan'!$I$30:$I$30),\"\",'FY25-26 Work Plan'!$I$30:$I$30)","v":""},{"$f":"IF(ISBLANK('FY25-26 Work Plan'!$B$31:$B$31),\"\",'FY25-26 Work Plan'!$B$31:$B$31)","v":""},{"$f":"IF(ISBLANK('FY25-26 Work Plan'!$E$31:$E$31),\"\",'FY25-26 Work Plan'!$E$31:$E$31)","v":""},{"$f":"IF(ISBLANK('FY25-26 Work Plan'!$I$31:$I$31),\"\",'FY25-26 Work Plan'!$I$31:$I$31)","v":""},{"$f":"IF(ISBLANK('FY25-26 Work Plan'!$B$32:$B$32),\"\",'FY25-26 Work Plan'!$B$32:$B$32)","v":""},{"$f":"IF(ISBLANK('FY25-26 Work Plan'!$E$32:$E$32),\"\",'FY25-26 Work Plan'!$E$32:$E$32)","v":""},{"$f":"IF(ISBLANK('FY25-26 Work Plan'!$I$32:$I$32),\"\",'FY25-26 Work Plan'!$I$32:$I$32)","v":""},{"$f":"IF(ISBLANK('FY25-26 Work Plan'!#REF!),\"\",'FY25-26 Work Plan'!#REF!)","v":{"$error":"#REF!"}},{"$f":"IF(ISBLANK('FY25-26 Work Plan'!#REF!),\"\",'FY25-26 Work Plan'!#REF!)","v":{"$error":"#REF!"}},{"$f":"IF(ISBLANK('FY25-26 Work Plan'!#REF!),\"\",'FY25-26 Work Plan'!#REF!)","v":{"$error":"#REF!"}},{"$f":"IF(ISBLANK('FY25-26 Work Plan'!#REF!),\"\",'FY25-26 Work Plan'!#REF!)","v":{"$error":"#REF!"}},{"$f":"IF(ISBLANK('FY25-26 Work Plan'!#REF!),\"\",'FY25-26 Work Plan'!#REF!)","v":{"$error":"#REF!"}},{"$f":"IF(ISBLANK('FY25-26 Work Plan'!#REF!),\"\",'FY25-26 Work Plan'!#REF!)","v":{"$error":"#REF!"}},{"$f":"IF(ISBLANK('FY25-26 Work Plan'!#REF!),\"\",'FY25-26 Work Plan'!#REF!)","v":{"$error":"#REF!"}},{"$f":"IF(ISBLANK('FY25-26 Work Plan'!#REF!),\"\",'FY25-26 Work Plan'!#REF!)","v":{"$error":"#REF!"}},{"$f":"IF(ISBLANK('FY25-26 Work Plan'!#REF!),\"\",'FY25-26 Work Plan'!#REF!)","v":{"$error":"#REF!"}}]
[{"$f":"IF(ISBLANK('FY25-26 Work Plan'!$E$2:$E$2),\"\",'FY25-26 Work Plan'!$E$2:$E$2)","v":"Asian American Drug Abuse Programs, Inc. (AADAP)"},{"$f":"IF(ISBLANK('FY25-26 Work Plan'!$L$2:$L$2),\"\",'FY25-26 Work Plan'!$L$2:$L$2)","v":"Prevention Education Program (PEP)"},{"$f":"IF(ISBLANK('FY25-26 Work Plan'!$L$3:$L$3),\"\",'FY25-26 Work Plan'!$L$3:$L$3)","v":""},{"$f":"IF(ISBLANK('FY25-26 Work Plan'!$E$3:$E$3),\"\",'FY25-26 Work Plan'!$E$3:$E$3)","v":"PH-005150 "},{"$f":"IF(ISBLANK('FY25-26 Work Plan'!$E$4:$E$4),\"\",TEXT('FY25-26 Work Plan'!$E$4:$E$4,\"000000\"))","v":"000001"},{"$f":"IF(ISBLANK('FY25-26 Work Plan'!$L$4:$L$4),\"\",'FY25-26 Work Plan'!$L$4:$L$4)","v":""},{"$f":"IF(ISBLANK('FY25-26 Work Plan'!$E$5:$E$5),\"\",'FY25-26 Work Plan'!$E$5:$E$5)","v":"2 - San Fernando Valley"},{"$f":"IF(ISBLANK('FY25-26 Work Plan'!$L$5:$L$5),\"\",'FY25-26 Work Plan'!$L$5:$L$5)","v":""},{"$f":"IF(ISBLANK('FY25-26 Work Plan'!$E$6:$E$6),\"\",'FY25-26 Work Plan'!$E$6:$E$6)","v":"Agoura Hills, Agua Dulce*"},{"$f":"IF(ISBLANK('FY25-26 Work Plan'!$F$7:$F$7),\"\",'FY25-26 Work Plan'!$F$7:$F$7)","v":""},{"$f":"IF(ISBLANK('FY25-26 Work Plan'!$F$8:$F$8),\"\",'FY25-26 Work Plan'!$F$8:$F$8)","v":""},{"$f":"IF(ISBLANK('FY25-26 Work Plan'!$E$9:$E$9),\"\",'FY25-26 Work Plan'!$E$9:$E$9)","v":"123 E Main St., Suite 100 \nAnytown, CA 90000"},{"$f":"IF(ISBLANK('FY25-26 Work Plan'!$L$9:$L$9),\"\",TEXT('FY25-26 Work Plan'!$L$9:$L$9,\"###-###-####\"))","v":"999-999-9999"},{"$f":"IF(ISBLANK('FY25-26 Work Plan'!$L$10:$L$10),\"\",'FY25-26 Work Plan'!$L$10:$L$10)","v":"www.abc1.org"},{"$f":"IF(ISBLANK('FY25-26 Work Plan'!$E$11:$E$11),\"\",'FY25-26 Work Plan'!$E$11:$E$11)","v":"123 E Main St., Suite 100 \nAnytown, CA 90000"},{"$f":"IF(ISBLANK('FY25-26 Work Plan'!$L$11:$L$11),\"\",TEXT('FY25-26 Work Plan'!$L$11:$L$11,\"###-###-####\"))","v":"999-999-9999"},{"$f":"IF(ISBLANK('FY25-26 Work Plan'!$L$12:$L$12),\"\",'FY25-26 Work Plan'!$L$12:$L$12)","v":"www.abc2.org"},{"$f":"IF(ISBLANK('FY25-26 Work Plan'!$E$15:$E$15),\"\",'FY25-26 Work Plan'!$E$15:$E$15)","v":"John/Jane Doe"},{"$f":"IF(ISBLANK('FY25-26 Work Plan'!$I$15:$I$15),\"\",TEXT('FY25-26 Work Plan'!$I$15:$I$15,\"###-###-####\"))","v":"213-555-1212"},{"$f":"IF(ISBLANK('FY25-26 Work Plan'!$L$15:$L$15),\"\",'FY25-26 Work Plan'!$L$15:$L$15)","v":"janedoe@preventionusa.com"},{"$f":"IF(ISBLANK('FY25-26 Work Plan'!$E$16:$E$16),\"\",'FY25-26 Work Plan'!$E$16:$E$16)","v":"John/Jane Doe"},{"$f":"IF(ISBLANK('FY25-26 Work Plan'!$I$16:$I$16),\"\",TEXT('FY25-26 Work Plan'!$I$16:$I$16,\"###-###-####\"))","v":"213-555-1212"},{"$f":"IF(ISBLANK('FY25-26 Work Plan'!$L$16:$L$16),\"\",'FY25-26 Work Plan'!$L$16:$L$16)","v":"janedoe@preventionusa.com"},{"$f":"IF(ISBLANK('FY25-26 Work Plan'!$E$17:$E$17),\"\",'FY25-26 Work Plan'!$E$17:$E$17)","v":"John/Jane Doe"},{"$f":"IF(ISBLANK('FY25-26 Work Plan'!$I$17:$I$17),\"\",TEXT('FY25-26 Work Plan'!$I$17:$I$17,\"###-###-####\"))","v":"213-555-1212"},{"$f":"IF(ISBLANK('FY25-26 Work Plan'!$L$17:$L$17),\"\",'FY25-26 Work Plan'!$L$17:$L$17)","v":"j.doe@preventionusa.com"},{"$f":"IF(ISBLANK('FY25-26 Work Plan'!$E$18:$E$18),\"\",'FY25-26 Work Plan'!$E$18:$E$18)","v":"John/Jane Doe"},{"$f":"IF(ISBLANK('FY25-26 Work Plan'!$I$18:$I$18),\"\",TEXT('FY25-26 Work Plan'!$I$18:$I$18,\"###-###-####\"))","v":"213-555-1213"},{"$f":"IF(ISBLANK('FY25-26 Work Plan'!$L$18:$L$18),\"\",'FY25-26 Work Plan'!$L$18:$L$18)","v":"j.doe@preventionusa.com"},{"$f":"IF(ISBLANK('FY25-26 Work Plan'!$E$19:$E$19),\"\",'FY25-26 Work Plan'!$E$19:$E$19)","v":"John/Jane Doe"},{"$f":"IF(ISBLANK('FY25-26 Work Plan'!$I$19:$I$19),\"\",TEXT('FY25-26 Work Plan'!$I$19:$I$19,\"###-###-####\"))","v":"213-555-1213"},{"$f":"IF(ISBLANK('FY25-26 Work Plan'!$L$19:$L$19),\"\",'FY25-26 Work Plan'!$L$19:$L$19)","v":"j.doe@preventionusa.com"},{"$f":"IF(ISBLANK('FY25-26 Work Plan'!$E$23:$E$23),\"\",'FY25-26 Work Plan'!$E$23:$E$23)","v":""},{"$f":"IF(ISBLANK('FY25-26 Work Plan'!$I$23:$I$23),\"\",'FY25-26 Work Plan'!$I$23:$I$23)","v":""},{"$f":"IF(ISBLANK('FY25-26 Work Plan'!$E$24:$E$24),\"\",'FY25-26 Work Plan'!$E$24:$E$24)","v":""},{"$f":"IF(ISBLANK('FY25-26 Work Plan'!$I$24:$I$24),\"\",'FY25-26 Work Plan'!$I$24:$I$24)","v":""},{"$f":"IF(ISBLANK('FY25-26 Work Plan'!$E$25:$E$25),\"\",'FY25-26 Work Plan'!$E$25:$E$25)","v":""},{"$f":"IF(ISBLANK('FY25-26 Work Plan'!$I$25:$I$25),\"\",'FY25-26 Work Plan'!$I$25:$I$25)","v":""},{"$f":"IF(ISBLANK('FY25-26 Work Plan'!$E$26:$E$26),\"\",'FY25-26 Work Plan'!$E$26:$E$26)","v":""},{"$f":"IF(ISBLANK('FY25-26 Work Plan'!$I$26:$I$26),\"\",'FY25-26 Work Plan'!$I$26:$I$26)","v":""},{"$f":"IF(ISBLANK('FY25-26 Work Plan'!$E$27:$E$27),\"\",'FY25-26 Work Plan'!$E$27:$E$27)","v":""},{"$f":"IF(ISBLANK('FY25-26 Work Plan'!$I$27:$I$27),\"\",'FY25-26 Work Plan'!$I$27:$I$27)","v":""},{"$f":"IF(ISBLANK('FY25-26 Work Plan'!$E$28:$E$28),\"\",'FY25-26 Work Plan'!$E$28:$E$28)","v":""},{"$f":"IF(ISBLANK('FY25-26 Work Plan'!$I$28:$I$28),\"\",'FY25-26 Work Plan'!$I$28:$I$28)","v":""},{"$f":"IF(ISBLANK('FY25-26 Work Plan'!$E$29:$E$29),\"\",'FY25-26 Work Plan'!$E$29:$E$29)","v":""},{"$f":"IF(ISBLANK('FY25-26 Work Plan'!$I$29:$I$29),\"\",'FY25-26 Work Plan'!$I$29:$I$29)","v":""},{"$f":"IF(ISBLANK('FY25-26 Work Plan'!$B$30:$B$30),\"\",'FY25-26 Work Plan'!$B$30:$B$30)","v":""},{"$f":"IF(ISBLANK('FY25-26 Work Plan'!$E$30:$E$30),\"\",'FY25-26 Work Plan'!$E$30:$E$30)","v":""},{"$f":"IF(ISBLANK('FY25-26 Work Plan'!$I$30:$I$30),\"\",'FY25-26 Work Plan'!$I$30:$I$30)","v":""},{"$f":"IF(ISBLANK('FY25-26 Work Plan'!$B$31:$B$31),\"\",'FY25-26 Work Plan'!$B$31:$B$31)","v":""},{"$f":"IF(ISBLANK('FY25-26 Work Plan'!$E$31:$E$31),\"\",'FY25-26 Work Plan'!$E$31:$E$31)","v":""},{"$f":"IF(ISBLANK('FY25-26 Work Plan'!$I$31:$I$31),\"\",'FY25-26 Work Plan'!$I$31:$I$31)","v":""},{"$f":"IF(ISBLANK('FY25-26 Work Plan'!$B$32:$B$32),\"\",'FY25-26 Work Plan'!$B$32:$B$32)","v":""},{"$f":"IF(ISBLANK('FY25-26 Work Plan'!$E$32:$E$32),\"\",'FY25-26 Work Plan'!$E$32:$E$32)","v":""},{"$f":"IF(ISBLANK('FY25-26 Work Plan'!$I$32:$I$32),\"\",'FY25-26 Work Plan'!$I$32:$I$32)","v":""},{"$f":"IF(ISBLANK('FY25-26 Work Plan'!#REF!),\"\",'FY25-26 Work Plan'!#REF!)","v":{"$error":"#REF!"}},{"$f":"IF(ISBLANK('FY25-26 Work Plan'!#REF!),\"\",'FY25-26 Work Plan'!#REF!)","v":{"$error":"#REF!"}},{"$f":"IF(ISBLANK('FY25-26 Work Plan'!#REF!),\"\",'FY25-26 Work Plan'!#REF!)","v":{"$error":"#REF!"}},{"$f":"IF(ISBLANK('FY25-26 Work Plan'!#REF!),\"\",'FY25-26 Work Plan'!#REF!)","v":{"$error":"#REF!"}},{"$f":"IF(ISBLANK('FY25-26 Work Plan'!#REF!),\"\",'FY25-26 Work Plan'!#REF!)","v":{"$error":"#REF!"}},{"$f":"IF(ISBLANK('FY25-26 Work Plan'!#REF!),\"\",'FY25-26 Work Plan'!#REF!)","v":{"$error":"#REF!"}},{"$f":"IF(ISBLANK('FY25-26 Work Plan'!#REF!),\"\",'FY25-26 Work Plan'!#REF!)","v":{"$error":"#REF!"}},{"$f":"IF(ISBLANK('FY25-26 Work Plan'!#REF!),\"\",'FY25-26 Work Plan'!#REF!)","v":{"$error":"#REF!"}},{"$f":"IF(ISBLANK('FY25-26 Work Plan'!#REF!),\"\",'FY25-26 Work Plan'!#REF!)","v":{"$error":"#REF!"}}]
[{"$f":"IF(ISBLANK('FY25-26 Work Plan'!$E$2:$E$2),\"\",'FY25-26 Work Plan'!$E$2:$E$2)","v":"Asian American Drug Abuse Programs, Inc. (AADAP)"},{"$f":"IF(ISBLANK('FY25-26 Work Plan'!$L$2:$L$2),\"\",'FY25-26 Work Plan'!$L$2:$L$2)","v":"Prevention Education Program (PEP)"},{"$f":"IF(ISBLANK('FY25-26 Work Plan'!$L$3:$L$3),\"\",'FY25-26 Work Plan'!$L$3:$L$3)","v":""},{"$f":"IF(ISBLANK('FY25-26 Work Plan'!$E$3:$E$3),\"\",'FY25-26 Work Plan'!$E$3:$E$3)","v":"PH-005150 "},{"$f":"IF(ISBLANK('FY25-26 Work Plan'!$E$4:$E$4),\"\",TEXT('FY25-26 Work Plan'!$E$4:$E$4,\"000000\"))","v":"000001"},{"$f":"IF(ISBLANK('FY25-26 Work Plan'!$L$4:$L$4),\"\",'FY25-26 Work Plan'!$L$4:$L$4)","v":""},{"$f":"IF(ISBLANK('FY25-26 Work Plan'!$E$5:$E$5),\"\",'FY25-26 Work Plan'!$E$5:$E$5)","v":"2 - San Fernando Valley"},{"$f":"IF(ISBLANK('FY25-26 Work Plan'!$L$5:$L$5),\"\",'FY25-26 Work Plan'!$L$5:$L$5)","v":""},{"$f":"IF(ISBLANK('FY25-26 Work Plan'!$E$6:$E$6),\"\",'FY25-26 Work Plan'!$E$6:$E$6)","v":"Agoura Hills, Agua Dulce*"},{"$f":"IF(ISBLANK('FY25-26 Work Plan'!$F$7:$F$7),\"\",'FY25-26 Work Plan'!$F$7:$F$7)","v":""},{"$f":"IF(ISBLANK('FY25-26 Work Plan'!$F$8:$F$8),\"\",'FY25-26 Work Plan'!$F$8:$F$8)","v":""},{"$f":"IF(ISBLANK('FY25-26 Work Plan'!$E$9:$E$9),\"\",'FY25-26 Work Plan'!$E$9:$E$9)","v":"123 E Main St., Suite 100 \nAnytown, CA 90000"},{"$f":"IF(ISBLANK('FY25-26 Work Plan'!$L$9:$L$9),\"\",TEXT('FY25-26 Work Plan'!$L$9:$L$9,\"###-###-####\"))","v":"999-999-9999"},{"$f":"IF(ISBLANK('FY25-26 Work Plan'!$L$10:$L$10),\"\",'FY25-26 Work Plan'!$L$10:$L$10)","v":"www.abc1.org"},{"$f":"IF(ISBLANK('FY25-26 Work Plan'!$E$11:$E$11),\"\",'FY25-26 Work Plan'!$E$11:$E$11)","v":"123 E Main St., Suite 100 \nAnytown, CA 90000"},{"$f":"IF(ISBLANK('FY25-26 Work Plan'!$L$11:$L$11),\"\",TEXT('FY25-26 Work Plan'!$L$11:$L$11,\"###-###-####\"))","v":"999-999-9999"},{"$f":"IF(ISBLANK('FY25-26 Work Plan'!$L$12:$L$12),\"\",'FY25-26 Work Plan'!$L$12:$L$12)","v":"www.abc2.org"},{"$f":"IF(ISBLANK('FY25-26 Work Plan'!$E$15:$E$15),\"\",'FY25-26 Work Plan'!$E$15:$E$15)","v":"John/Jane Doe"},{"$f":"IF(ISBLANK('FY25-26 Work Plan'!$I$15:$I$15),\"\",TEXT('FY25-26 Work Plan'!$I$15:$I$15,\"###-###-####\"))","v":"213-555-1212"},{"$f":"IF(ISBLANK('FY25-26 Work Plan'!$L$15:$L$15),\"\",'FY25-26 Work Plan'!$L$15:$L$15)","v":"janedoe@preventionusa.com"},{"$f":"IF(ISBLANK('FY25-26 Work Plan'!$E$16:$E$16),\"\",'FY25-26 Work Plan'!$E$16:$E$16)","v":"John/Jane Doe"},{"$f":"IF(ISBLANK('FY25-26 Work Plan'!$I$16:$I$16),\"\",TEXT('FY25-26 Work Plan'!$I$16:$I$16,\"###-###-####\"))","v":"213-555-1212"},{"$f":"IF(ISBLANK('FY25-26 Work Plan'!$L$16:$L$16),\"\",'FY25-26 Work Plan'!$L$16:$L$16)","v":"janedoe@preventionusa.com"},{"$f":"IF(ISBLANK('FY25-26 Work Plan'!$E$17:$E$17),\"\",'FY25-26 Work Plan'!$E$17:$E$17)","v":"John/Jane Doe"},{"$f":"IF(ISBLANK('FY25-26 Work Plan'!$I$17:$I$17),\"\",TEXT('FY25-26 Work Plan'!$I$17:$I$17,\"###-###-####\"))","v":"213-555-1212"},{"$f":"IF(ISBLANK('FY25-26 Work Plan'!$L$17:$L$17),\"\",'FY25-26 Work Plan'!$L$17:$L$17)","v":"j.doe@preventionusa.com"},{"$f":"IF(ISBLANK('FY25-26 Work Plan'!$E$18:$E$18),\"\",'FY25-26 Work Plan'!$E$18:$E$18)","v":"John/Jane Doe"},{"$f":"IF(ISBLANK('FY25-26 Work Plan'!$I$18:$I$18),\"\",TEXT('FY25-26 Work Plan'!$I$18:$I$18,\"###-###-####\"))","v":"213-555-1213"},{"$f":"IF(ISBLANK('FY25-26 Work Plan'!$L$18:$L$18),\"\",'FY25-26 Work Plan'!$L$18:$L$18)","v":"j.doe@preventionusa.com"},{"$f":"IF(ISBLANK('FY25-26 Work Plan'!$E$19:$E$19),\"\",'FY25-26 Work Plan'!$E$19:$E$19)","v":"John/Jane Doe"},{"$f":"IF(ISBLANK('FY25-26 Work Plan'!$I$19:$I$19),\"\",TEXT('FY25-26 Work Plan'!$I$19:$I$19,\"###-###-####\"))","v":"213-555-1213"},{"$f":"IF(ISBLANK('FY25-26 Work Plan'!$L$19:$L$19),\"\",'FY25-26 Work Plan'!$L$19:$L$19)","v":"j.doe@preventionusa.com"},{"$f":"IF(ISBLANK('FY25-26 Work Plan'!$E$23:$E$23),\"\",'FY25-26 Work Plan'!$E$23:$E$23)","v":""},{"$f":"IF(ISBLANK('FY25-26 Work Plan'!$I$23:$I$23),\"\",'FY25-26 Work Plan'!$I$23:$I$23)","v":""},{"$f":"IF(ISBLANK('FY25-26 Work Plan'!$E$24:$E$24),\"\",'FY25-26 Work Plan'!$E$24:$E$24)","v":""},{"$f":"IF(ISBLANK('FY25-26 Work Plan'!$I$24:$I$24),\"\",'FY25-26 Work Plan'!$I$24:$I$24)","v":""},{"$f":"IF(ISBLANK('FY25-26 Work Plan'!$E$25:$E$25),\"\",'FY25-26 Work Plan'!$E$25:$E$25)","v":""},{"$f":"IF(ISBLANK('FY25-26 Work Plan'!$I$25:$I$25),\"\",'FY25-26 Work Plan'!$I$25:$I$25)","v":""},{"$f":"IF(ISBLANK('FY25-26 Work Plan'!$E$26:$E$26),\"\",'FY25-26 Work Plan'!$E$26:$E$26)","v":""},{"$f":"IF(ISBLANK('FY25-26 Work Plan'!$I$26:$I$26),\"\",'FY25-26 Work Plan'!$I$26:$I$26)","v":""},{"$f":"IF(ISBLANK('FY25-26 Work Plan'!$E$27:$E$27),\"\",'FY25-26 Work Plan'!$E$27:$E$27)","v":""},{"$f":"IF(ISBLANK('FY25-26 Work Plan'!$I$27:$I$27),\"\",'FY25-26 Work Plan'!$I$27:$I$27)","v":""},{"$f":"IF(ISBLANK('FY25-26 Work Plan'!$E$28:$E$28),\"\",'FY25-26 Work Plan'!$E$28:$E$28)","v":""},{"$f":"IF(ISBLANK('FY25-26 Work Plan'!$I$28:$I$28),\"\",'FY25-26 Work Plan'!$I$28:$I$28)","v":""},{"$f":"IF(ISBLANK('FY25-26 Work Plan'!$E$29:$E$29),\"\",'FY25-26 Work Plan'!$E$29:$E$29)","v":""},{"$f":"IF(ISBLANK('FY25-26 Work Plan'!$I$29:$I$29),\"\",'FY25-26 Work Plan'!$I$29:$I$29)","v":""},{"$f":"IF(ISBLANK('FY25-26 Work Plan'!$B$30:$B$30),\"\",'FY25-26 Work Plan'!$B$30:$B$30)","v":""},{"$f":"IF(ISBLANK('FY25-26 Work Plan'!$E$30:$E$30),\"\",'FY25-26 Work Plan'!$E$30:$E$30)","v":""},{"$f":"IF(ISBLANK('FY25-26 Work Plan'!$I$30:$I$30),\"\",'FY25-26 Work Plan'!$I$30:$I$30)","v":""},{"$f":"IF(ISBLANK('FY25-26 Work Plan'!$B$31:$B$31),\"\",'FY25-26 Work Plan'!$B$31:$B$31)","v":""},{"$f":"IF(ISBLANK('FY25-26 Work Plan'!$E$31:$E$31),\"\",'FY25-26 Work Plan'!$E$31:$E$31)","v":""},{"$f":"IF(ISBLANK('FY25-26 Work Plan'!$I$31:$I$31),\"\",'FY25-26 Work Plan'!$I$31:$I$31)","v":""},{"$f":"IF(ISBLANK('FY25-26 Work Plan'!$B$32:$B$32),\"\",'FY25-26 Work Plan'!$B$32:$B$32)","v":""},{"$f":"IF(ISBLANK('FY25-26 Work Plan'!$E$32:$E$32),\"\",'FY25-26 Work Plan'!$E$32:$E$32)","v":""},{"$f":"IF(ISBLANK('FY25-26 Work Plan'!$I$32:$I$32),\"\",'FY25-26 Work Plan'!$I$32:$I$32)","v":""},{"$f":"IF(ISBLANK('FY25-26 Work Plan'!#REF!),\"\",'FY25-26 Work Plan'!#REF!)","v":{"$error":"#REF!"}},{"$f":"IF(ISBLANK('FY25-26 Work Plan'!#REF!),\"\",'FY25-26 Work Plan'!#REF!)","v":{"$error":"#REF!"}},{"$f":"IF(ISBLANK('FY25-26 Work Plan'!#REF!),\"\",'FY25-26 Work Plan'!#REF!)","v":{"$error":"#REF!"}},{"$f":"IF(ISBLANK('FY25-26 Work Plan'!#REF!),\"\",'FY25-26 Work Plan'!#REF!)","v":{"$error":"#REF!"}},{"$f":"IF(ISBLANK('FY25-26 Work Plan'!#REF!),\"\",'FY25-26 Work Plan'!#REF!)","v":{"$error":"#REF!"}},{"$f":"IF(ISBLANK('FY25-26 Work Plan'!#REF!),\"\",'FY25-26 Work Plan'!#REF!)","v":{"$error":"#REF!"}},{"$f":"IF(ISBLANK('FY25-26 Work Plan'!#REF!),\"\",'FY25-26 Work Plan'!#REF!)","v":{"$error":"#REF!"}},{"$f":"IF(ISBLANK('FY25-26 Work Plan'!#REF!),\"\",'FY25-26 Work Plan'!#REF!)","v":{"$error":"#REF!"}},{"$f":"IF(ISBLANK('FY25-26 Work Plan'!#REF!),\"\",'FY25-26 Work Plan'!#REF!)","v":{"$error":"#REF!"}}]
[{"$f":"IF(ISBLANK('FY25-26 Work Plan'!$E$2:$E$2),\"\",'FY25-26 Work Plan'!$E$2:$E$2)","v":"Asian American Drug Abuse Programs, Inc. (AADAP)"},{"$f":"IF(ISBLANK('FY25-26 Work Plan'!$L$2:$L$2),\"\",'FY25-26 Work Plan'!$L$2:$L$2)","v":"Prevention Education Program (PEP)"},{"$f":"IF(ISBLANK('FY25-26 Work Plan'!$L$3:$L$3),\"\",'FY25-26 Work Plan'!$L$3:$L$3)","v":""},{"$f":"IF(ISBLANK('FY25-26 Work Plan'!$E$3:$E$3),\"\",'FY25-26 Work Plan'!$E$3:$E$3)","v":"PH-005150 "},{"$f":"IF(ISBLANK('FY25-26 Work Plan'!$E$4:$E$4),\"\",TEXT('FY25-26 Work Plan'!$E$4:$E$4,\"000000\"))","v":"000001"},{"$f":"IF(ISBLANK('FY25-26 Work Plan'!$L$4:$L$4),\"\",'FY25-26 Work Plan'!$L$4:$L$4)","v":""},{"$f":"IF(ISBLANK('FY25-26 Work Plan'!$E$5:$E$5),\"\",'FY25-26 Work Plan'!$E$5:$E$5)","v":"2 - San Fernando Valley"},{"$f":"IF(ISBLANK('FY25-26 Work Plan'!$L$5:$L$5),\"\",'FY25-26 Work Plan'!$L$5:$L$5)","v":""},{"$f":"IF(ISBLANK('FY25-26 Work Plan'!$E$6:$E$6),\"\",'FY25-26 Work Plan'!$E$6:$E$6)","v":"Agoura Hills, Agua Dulce*"},{"$f":"IF(ISBLANK('FY25-26 Work Plan'!$F$7:$F$7),\"\",'FY25-26 Work Plan'!$F$7:$F$7)","v":""},{"$f":"IF(ISBLANK('FY25-26 Work Plan'!$F$8:$F$8),\"\",'FY25-26 Work Plan'!$F$8:$F$8)","v":""},{"$f":"IF(ISBLANK('FY25-26 Work Plan'!$E$9:$E$9),\"\",'FY25-26 Work Plan'!$E$9:$E$9)","v":"123 E Main St., Suite 100 \nAnytown, CA 90000"},{"$f":"IF(ISBLANK('FY25-26 Work Plan'!$L$9:$L$9),\"\",TEXT('FY25-26 Work Plan'!$L$9:$L$9,\"###-###-####\"))","v":"999-999-9999"},{"$f":"IF(ISBLANK('FY25-26 Work Plan'!$L$10:$L$10),\"\",'FY25-26 Work Plan'!$L$10:$L$10)","v":"www.abc1.org"},{"$f":"IF(ISBLANK('FY25-26 Work Plan'!$E$11:$E$11),\"\",'FY25-26 Work Plan'!$E$11:$E$11)","v":"123 E Main St., Suite 100 \nAnytown, CA 90000"},{"$f":"IF(ISBLANK('FY25-26 Work Plan'!$L$11:$L$11),\"\",TEXT('FY25-26 Work Plan'!$L$11:$L$11,\"###-###-####\"))","v":"999-999-9999"},{"$f":"IF(ISBLANK('FY25-26 Work Plan'!$L$12:$L$12),\"\",'FY25-26 Work Plan'!$L$12:$L$12)","v":"www.abc2.org"},{"$f":"IF(ISBLANK('FY25-26 Work Plan'!$E$15:$E$15),\"\",'FY25-26 Work Plan'!$E$15:$E$15)","v":"John/Jane Doe"},{"$f":"IF(ISBLANK('FY25-26 Work Plan'!$I$15:$I$15),\"\",TEXT('FY25-26 Work Plan'!$I$15:$I$15,\"###-###-####\"))","v":"213-555-1212"},{"$f":"IF(ISBLANK('FY25-26 Work Plan'!$L$15:$L$15),\"\",'FY25-26 Work Plan'!$L$15:$L$15)","v":"janedoe@preventionusa.com"},{"$f":"IF(ISBLANK('FY25-26 Work Plan'!$E$16:$E$16),\"\",'FY25-26 Work Plan'!$E$16:$E$16)","v":"John/Jane Doe"},{"$f":"IF(ISBLANK('FY25-26 Work Plan'!$I$16:$I$16),\"\",TEXT('FY25-26 Work Plan'!$I$16:$I$16,\"###-###-####\"))","v":"213-555-1212"},{"$f":"IF(ISBLANK('FY25-26 Work Plan'!$L$16:$L$16),\"\",'FY25-26 Work Plan'!$L$16:$L$16)","v":"janedoe@preventionusa.com"},{"$f":"IF(ISBLANK('FY25-26 Work Plan'!$E$17:$E$17),\"\",'FY25-26 Work Plan'!$E$17:$E$17)","v":"John/Jane Doe"},{"$f":"IF(ISBLANK('FY25-26 Work Plan'!$I$17:$I$17),\"\",TEXT('FY25-26 Work Plan'!$I$17:$I$17,\"###-###-####\"))","v":"213-555-1212"},{"$f":"IF(ISBLANK('FY25-26 Work Plan'!$L$17:$L$17),\"\",'FY25-26 Work Plan'!$L$17:$L$17)","v":"j.doe@preventionusa.com"},{"$f":"IF(ISBLANK('FY25-26 Work Plan'!$E$18:$E$18),\"\",'FY25-26 Work Plan'!$E$18:$E$18)","v":"John/Jane Doe"},{"$f":"IF(ISBLANK('FY25-26 Work Plan'!$I$18:$I$18),\"\",TEXT('FY25-26 Work Plan'!$I$18:$I$18,\"###-###-####\"))","v":"213-555-1213"},{"$f":"IF(ISBLANK('FY25-26 Work Plan'!$L$18:$L$18),\"\",'FY25-26 Work Plan'!$L$18:$L$18)","v":"j.doe@preventionusa.com"},{"$f":"IF(ISBLANK('FY25-26 Work Plan'!$E$19:$E$19),\"\",'FY25-26 Work Plan'!$E$19:$E$19)","v":"John/Jane Doe"},{"$f":"IF(ISBLANK('FY25-26 Work Plan'!$I$19:$I$19),\"\",TEXT('FY25-26 Work Plan'!$I$19:$I$19,\"###-###-####\"))","v":"213-555-1213"},{"$f":"IF(ISBLANK('FY25-26 Work Plan'!$L$19:$L$19),\"\",'FY25-26 Work Plan'!$L$19:$L$19)","v":"j.doe@preventionusa.com"},{"$f":"IF(ISBLANK('FY25-26 Work Plan'!$E$23:$E$23),\"\",'FY25-26 Work Plan'!$E$23:$E$23)","v":""},{"$f":"IF(ISBLANK('FY25-26 Work Plan'!$I$23:$I$23),\"\",'FY25-26 Work Plan'!$I$23:$I$23)","v":""},{"$f":"IF(ISBLANK('FY25-26 Work Plan'!$E$24:$E$24),\"\",'FY25-26 Work Plan'!$E$24:$E$24)","v":""},{"$f":"IF(ISBLANK('FY25-26 Work Plan'!$I$24:$I$24),\"\",'FY25-26 Work Plan'!$I$24:$I$24)","v":""},{"$f":"IF(ISBLANK('FY25-26 Work Plan'!$E$25:$E$25),\"\",'FY25-26 Work Plan'!$E$25:$E$25)","v":""},{"$f":"IF(ISBLANK('FY25-26 Work Plan'!$I$25:$I$25),\"\",'FY25-26 Work Plan'!$I$25:$I$25)","v":""},{"$f":"IF(ISBLANK('FY25-26 Work Plan'!$E$26:$E$26),\"\",'FY25-26 Work Plan'!$E$26:$E$26)","v":""},{"$f":"IF(ISBLANK('FY25-26 Work Plan'!$I$26:$I$26),\"\",'FY25-26 Work Plan'!$I$26:$I$26)","v":""},{"$f":"IF(ISBLANK('FY25-26 Work Plan'!$E$27:$E$27),\"\",'FY25-26 Work Plan'!$E$27:$E$27)","v":""},{"$f":"IF(ISBLANK('FY25-26 Work Plan'!$I$27:$I$27),\"\",'FY25-26 Work Plan'!$I$27:$I$27)","v":""},{"$f":"IF(ISBLANK('FY25-26 Work Plan'!$E$28:$E$28),\"\",'FY25-26 Work Plan'!$E$28:$E$28)","v":""},{"$f":"IF(ISBLANK('FY25-26 Work Plan'!$I$28:$I$28),\"\",'FY25-26 Work Plan'!$I$28:$I$28)","v":""},{"$f":"IF(ISBLANK('FY25-26 Work Plan'!$E$29:$E$29),\"\",'FY25-26 Work Plan'!$E$29:$E$29)","v":""},{"$f":"IF(ISBLANK('FY25-26 Work Plan'!$I$29:$I$29),\"\",'FY25-26 Work Plan'!$I$29:$I$29)","v":""},{"$f":"IF(ISBLANK('FY25-26 Work Plan'!$B$30:$B$30),\"\",'FY25-26 Work Plan'!$B$30:$B$30)","v":""},{"$f":"IF(ISBLANK('FY25-26 Work Plan'!$E$30:$E$30),\"\",'FY25-26 Work Plan'!$E$30:$E$30)","v":""},{"$f":"IF(ISBLANK('FY25-26 Work Plan'!$I$30:$I$30),\"\",'FY25-26 Work Plan'!$I$30:$I$30)","v":""},{"$f":"IF(ISBLANK('FY25-26 Work Plan'!$B$31:$B$31),\"\",'FY25-26 Work Plan'!$B$31:$B$31)","v":""},{"$f":"IF(ISBLANK('FY25-26 Work Plan'!$E$31:$E$31),\"\",'FY25-26 Work Plan'!$E$31:$E$31)","v":""},{"$f":"IF(ISBLANK('FY25-26 Work Plan'!$I$31:$I$31),\"\",'FY25-26 Work Plan'!$I$31:$I$31)","v":""},{"$f":"IF(ISBLANK('FY25-26 Work Plan'!$B$32:$B$32),\"\",'FY25-26 Work Plan'!$B$32:$B$32)","v":""},{"$f":"IF(ISBLANK('FY25-26 Work Plan'!$E$32:$E$32),\"\",'FY25-26 Work Plan'!$E$32:$E$32)","v":""},{"$f":"IF(ISBLANK('FY25-26 Work Plan'!$I$32:$I$32),\"\",'FY25-26 Work Plan'!$I$32:$I$32)","v":""},{"$f":"IF(ISBLANK('FY25-26 Work Plan'!#REF!),\"\",'FY25-26 Work Plan'!#REF!)","v":{"$error":"#REF!"}},{"$f":"IF(ISBLANK('FY25-26 Work Plan'!#REF!),\"\",'FY25-26 Work Plan'!#REF!)","v":{"$error":"#REF!"}},{"$f":"IF(ISBLANK('FY25-26 Work Plan'!#REF!),\"\",'FY25-26 Work Plan'!#REF!)","v":{"$error":"#REF!"}},{"$f":"IF(ISBLANK('FY25-26 Work Plan'!#REF!),\"\",'FY25-26 Work Plan'!#REF!)","v":{"$error":"#REF!"}},{"$f":"IF(ISBLANK('FY25-26 Work Plan'!#REF!),\"\",'FY25-26 Work Plan'!#REF!)","v":{"$error":"#REF!"}},{"$f":"IF(ISBLANK('FY25-26 Work Plan'!#REF!),\"\",'FY25-26 Work Plan'!#REF!)","v":{"$error":"#REF!"}},{"$f":"IF(ISBLANK('FY25-26 Work Plan'!#REF!),\"\",'FY25-26 Work Plan'!#REF!)","v":{"$error":"#REF!"}},{"$f":"IF(ISBLANK('FY25-26 Work Plan'!#REF!),\"\",'FY25-26 Work Plan'!#REF!)","v":{"$error":"#REF!"}},{"$f":"IF(ISBLANK('FY25-26 Work Plan'!#REF!),\"\",'FY25-26 Work Plan'!#REF!)","v":{"$error":"#REF!"}}]
[{"$f":"IF(ISBLANK('FY25-26 Work Plan'!$E$2:$E$2),\"\",'FY25-26 Work Plan'!$E$2:$E$2)","v":"Asian American Drug Abuse Programs, Inc. (AADAP)"},{"$f":"IF(ISBLANK('FY25-26 Work Plan'!$L$2:$L$2),\"\",'FY25-26 Work Plan'!$L$2:$L$2)","v":"Prevention Education Program (PEP)"},{"$f":"IF(ISBLANK('FY25-26 Work Plan'!$L$3:$L$3),\"\",'FY25-26 Work Plan'!$L$3:$L$3)","v":""},{"$f":"IF(ISBLANK('FY25-26 Work Plan'!$E$3:$E$3),\"\",'FY25-26 Work Plan'!$E$3:$E$3)","v":"PH-005150 "},{"$f":"IF(ISBLANK('FY25-26 Work Plan'!$E$4:$E$4),\"\",TEXT('FY25-26 Work Plan'!$E$4:$E$4,\"000000\"))","v":"000001"},{"$f":"IF(ISBLANK('FY25-26 Work Plan'!$L$4:$L$4),\"\",'FY25-26 Work Plan'!$L$4:$L$4)","v":""},{"$f":"IF(ISBLANK('FY25-26 Work Plan'!$E$5:$E$5),\"\",'FY25-26 Work Plan'!$E$5:$E$5)","v":"2 - San Fernando Valley"},{"$f":"IF(ISBLANK('FY25-26 Work Plan'!$L$5:$L$5),\"\",'FY25-26 Work Plan'!$L$5:$L$5)","v":""},{"$f":"IF(ISBLANK('FY25-26 Work Plan'!$E$6:$E$6),\"\",'FY25-26 Work Plan'!$E$6:$E$6)","v":"Agoura Hills, Agua Dulce*"},{"$f":"IF(ISBLANK('FY25-26 Work Plan'!$F$7:$F$7),\"\",'FY25-26 Work Plan'!$F$7:$F$7)","v":""},{"$f":"IF(ISBLANK('FY25-26 Work Plan'!$F$8:$F$8),\"\",'FY25-26 Work Plan'!$F$8:$F$8)","v":""},{"$f":"IF(ISBLANK('FY25-26 Work Plan'!$E$9:$E$9),\"\",'FY25-26 Work Plan'!$E$9:$E$9)","v":"123 E Main St., Suite 100 \nAnytown, CA 90000"},{"$f":"IF(ISBLANK('FY25-26 Work Plan'!$L$9:$L$9),\"\",TEXT('FY25-26 Work Plan'!$L$9:$L$9,\"###-###-####\"))","v":"999-999-9999"},{"$f":"IF(ISBLANK('FY25-26 Work Plan'!$L$10:$L$10),\"\",'FY25-26 Work Plan'!$L$10:$L$10)","v":"www.abc1.org"},{"$f":"IF(ISBLANK('FY25-26 Work Plan'!$E$11:$E$11),\"\",'FY25-26 Work Plan'!$E$11:$E$11)","v":"123 E Main St., Suite 100 \nAnytown, CA 90000"},{"$f":"IF(ISBLANK('FY25-26 Work Plan'!$L$11:$L$11),\"\",TEXT('FY25-26 Work Plan'!$L$11:$L$11,\"###-###-####\"))","v":"999-999-9999"},{"$f":"IF(ISBLANK('FY25-26 Work Plan'!$L$12:$L$12),\"\",'FY25-26 Work Plan'!$L$12:$L$12)","v":"www.abc2.org"},{"$f":"IF(ISBLANK('FY25-26 Work Plan'!$E$15:$E$15),\"\",'FY25-26 Work Plan'!$E$15:$E$15)","v":"John/Jane Doe"},{"$f":"IF(ISBLANK('FY25-26 Work Plan'!$I$15:$I$15),\"\",TEXT('FY25-26 Work Plan'!$I$15:$I$15,\"###-###-####\"))","v":"213-555-1212"},{"$f":"IF(ISBLANK('FY25-26 Work Plan'!$L$15:$L$15),\"\",'FY25-26 Work Plan'!$L$15:$L$15)","v":"janedoe@preventionusa.com"},{"$f":"IF(ISBLANK('FY25-26 Work Plan'!$E$16:$E$16),\"\",'FY25-26 Work Plan'!$E$16:$E$16)","v":"John/Jane Doe"},{"$f":"IF(ISBLANK('FY25-26 Work Plan'!$I$16:$I$16),\"\",TEXT('FY25-26 Work Plan'!$I$16:$I$16,\"###-###-####\"))","v":"213-555-1212"},{"$f":"IF(ISBLANK('FY25-26 Work Plan'!$L$16:$L$16),\"\",'FY25-26 Work Plan'!$L$16:$L$16)","v":"janedoe@preventionusa.com"},{"$f":"IF(ISBLANK('FY25-26 Work Plan'!$E$17:$E$17),\"\",'FY25-26 Work Plan'!$E$17:$E$17)","v":"John/Jane Doe"},{"$f":"IF(ISBLANK('FY25-26 Work Plan'!$I$17:$I$17),\"\",TEXT('FY25-26 Work Plan'!$I$17:$I$17,\"###-###-####\"))","v":"213-555-1212"},{"$f":"IF(ISBLANK('FY25-26 Work Plan'!$L$17:$L$17),\"\",'FY25-26 Work Plan'!$L$17:$L$17)","v":"j.doe@preventionusa.com"},{"$f":"IF(ISBLANK('FY25-26 Work Plan'!$E$18:$E$18),\"\",'FY25-26 Work Plan'!$E$18:$E$18)","v":"John/Jane Doe"},{"$f":"IF(ISBLANK('FY25-26 Work Plan'!$I$18:$I$18),\"\",TEXT('FY25-26 Work Plan'!$I$18:$I$18,\"###-###-####\"))","v":"213-555-1213"},{"$f":"IF(ISBLANK('FY25-26 Work Plan'!$L$18:$L$18),\"\",'FY25-26 Work Plan'!$L$18:$L$18)","v":"j.doe@preventionusa.com"},{"$f":"IF(ISBLANK('FY25-26 Work Plan'!$E$19:$E$19),\"\",'FY25-26 Work Plan'!$E$19:$E$19)","v":"John/Jane Doe"},{"$f":"IF(ISBLANK('FY25-26 Work Plan'!$I$19:$I$19),\"\",TEXT('FY25-26 Work Plan'!$I$19:$I$19,\"###-###-####\"))","v":"213-555-1213"},{"$f":"IF(ISBLANK('FY25-26 Work Plan'!$L$19:$L$19),\"\",'FY25-26 Work Plan'!$L$19:$L$19)","v":"j.doe@preventionusa.com"},{"$f":"IF(ISBLANK('FY25-26 Work Plan'!$E$23:$E$23),\"\",'FY25-26 Work Plan'!$E$23:$E$23)","v":""},{"$f":"IF(ISBLANK('FY25-26 Work Plan'!$I$23:$I$23),\"\",'FY25-26 Work Plan'!$I$23:$I$23)","v":""},{"$f":"IF(ISBLANK('FY25-26 Work Plan'!$E$24:$E$24),\"\",'FY25-26 Work Plan'!$E$24:$E$24)","v":""},{"$f":"IF(ISBLANK('FY25-26 Work Plan'!$I$24:$I$24),\"\",'FY25-26 Work Plan'!$I$24:$I$24)","v":""},{"$f":"IF(ISBLANK('FY25-26 Work Plan'!$E$25:$E$25),\"\",'FY25-26 Work Plan'!$E$25:$E$25)","v":""},{"$f":"IF(ISBLANK('FY25-26 Work Plan'!$I$25:$I$25),\"\",'FY25-26 Work Plan'!$I$25:$I$25)","v":""},{"$f":"IF(ISBLANK('FY25-26 Work Plan'!$E$26:$E$26),\"\",'FY25-26 Work Plan'!$E$26:$E$26)","v":""},{"$f":"IF(ISBLANK('FY25-26 Work Plan'!$I$26:$I$26),\"\",'FY25-26 Work Plan'!$I$26:$I$26)","v":""},{"$f":"IF(ISBLANK('FY25-26 Work Plan'!$E$27:$E$27),\"\",'FY25-26 Work Plan'!$E$27:$E$27)","v":""},{"$f":"IF(ISBLANK('FY25-26 Work Plan'!$I$27:$I$27),\"\",'FY25-26 Work Plan'!$I$27:$I$27)","v":""},{"$f":"IF(ISBLANK('FY25-26 Work Plan'!$E$28:$E$28),\"\",'FY25-26 Work Plan'!$E$28:$E$28)","v":""},{"$f":"IF(ISBLANK('FY25-26 Work Plan'!$I$28:$I$28),\"\",'FY25-26 Work Plan'!$I$28:$I$28)","v":""},{"$f":"IF(ISBLANK('FY25-26 Work Plan'!$E$29:$E$29),\"\",'FY25-26 Work Plan'!$E$29:$E$29)","v":""},{"$f":"IF(ISBLANK('FY25-26 Work Plan'!$I$29:$I$29),\"\",'FY25-26 Work Plan'!$I$29:$I$29)","v":""},{"$f":"IF(ISBLANK('FY25-26 Work Plan'!$B$30:$B$30),\"\",'FY25-26 Work Plan'!$B$30:$B$30)","v":""},{"$f":"IF(ISBLANK('FY25-26 Work Plan'!$E$30:$E$30),\"\",'FY25-26 Work Plan'!$E$30:$E$30)","v":""},{"$f":"IF(ISBLANK('FY25-26 Work Plan'!$I$30:$I$30),\"\",'FY25-26 Work Plan'!$I$30:$I$30)","v":""},{"$f":"IF(ISBLANK('FY25-26 Work Plan'!$B$31:$B$31),\"\",'FY25-26 Work Plan'!$B$31:$B$31)","v":""},{"$f":"IF(ISBLANK('FY25-26 Work Plan'!$E$31:$E$31),\"\",'FY25-26 Work Plan'!$E$31:$E$31)","v":""},{"$f":"IF(ISBLANK('FY25-26 Work Plan'!$I$31:$I$31),\"\",'FY25-26 Work Plan'!$I$31:$I$31)","v":""},{"$f":"IF(ISBLANK('FY25-26 Work Plan'!$B$32:$B$32),\"\",'FY25-26 Work Plan'!$B$32:$B$32)","v":""},{"$f":"IF(ISBLANK('FY25-26 Work Plan'!$E$32:$E$32),\"\",'FY25-26 Work Plan'!$E$32:$E$32)","v":""},{"$f":"IF(ISBLANK('FY25-26 Work Plan'!$I$32:$I$32),\"\",'FY25-26 Work Plan'!$I$32:$I$32)","v":""},{"$f":"IF(ISBLANK('FY25-26 Work Plan'!#REF!),\"\",'FY25-26 Work Plan'!#REF!)","v":{"$error":"#REF!"}},{"$f":"IF(ISBLANK('FY25-26 Work Plan'!#REF!),\"\",'FY25-26 Work Plan'!#REF!)","v":{"$error":"#REF!"}},{"$f":"IF(ISBLANK('FY25-26 Work Plan'!#REF!),\"\",'FY25-26 Work Plan'!#REF!)","v":{"$error":"#REF!"}},{"$f":"IF(ISBLANK('FY25-26 Work Plan'!#REF!),\"\",'FY25-26 Work Plan'!#REF!)","v":{"$error":"#REF!"}},{"$f":"IF(ISBLANK('FY25-26 Work Plan'!#REF!),\"\",'FY25-26 Work Plan'!#REF!)","v":{"$error":"#REF!"}},{"$f":"IF(ISBLANK('FY25-26 Work Plan'!#REF!),\"\",'FY25-26 Work Plan'!#REF!)","v":{"$error":"#REF!"}},{"$f":"IF(ISBLANK('FY25-26 Work Plan'!#REF!),\"\",'FY25-26 Work Plan'!#REF!)","v":{"$error":"#REF!"}},{"$f":"IF(ISBLANK('FY25-26 Work Plan'!#REF!),\"\",'FY25-26 Work Plan'!#REF!)","v":{"$error":"#REF!"}},{"$f":"IF(ISBLANK('FY25-26 Work Plan'!#REF!),\"\",'FY25-26 Work Plan'!#REF!)","v":{"$error":"#REF!"}}]
[{"$f":"IF(ISBLANK('FY25-26 Work Plan'!$E$2:$E$2),\"\",'FY25-26 Work Plan'!$E$2:$E$2)","v":"Asian American Drug Abuse Programs, Inc. (AADAP)"},{"$f":"IF(ISBLANK('FY25-26 Work Plan'!$L$2:$L$2),\"\",'FY25-26 Work Plan'!$L$2:$L$2)","v":"Prevention Education Program (PEP)"},{"$f":"IF(ISBLANK('FY25-26 Work Plan'!$L$3:$L$3),\"\",'FY25-26 Work Plan'!$L$3:$L$3)","v":""},{"$f":"IF(ISBLANK('FY25-26 Work Plan'!$E$3:$E$3),\"\",'FY25-26 Work Plan'!$E$3:$E$3)","v":"PH-005150 "},{"$f":"IF(ISBLANK('FY25-26 Work Plan'!$E$4:$E$4),\"\",TEXT('FY25-26 Work Plan'!$E$4:$E$4,\"000000\"))","v":"000001"},{"$f":"IF(ISBLANK('FY25-26 Work Plan'!$L$4:$L$4),\"\",'FY25-26 Work Plan'!$L$4:$L$4)","v":""},{"$f":"IF(ISBLANK('FY25-26 Work Plan'!$E$5:$E$5),\"\",'FY25-26 Work Plan'!$E$5:$E$5)","v":"2 - San Fernando Valley"},{"$f":"IF(ISBLANK('FY25-26 Work Plan'!$L$5:$L$5),\"\",'FY25-26 Work Plan'!$L$5:$L$5)","v":""},{"$f":"IF(ISBLANK('FY25-26 Work Plan'!$E$6:$E$6),\"\",'FY25-26 Work Plan'!$E$6:$E$6)","v":"Agoura Hills, Agua Dulce*"},{"$f":"IF(ISBLANK('FY25-26 Work Plan'!$F$7:$F$7),\"\",'FY25-26 Work Plan'!$F$7:$F$7)","v":""},{"$f":"IF(ISBLANK('FY25-26 Work Plan'!$F$8:$F$8),\"\",'FY25-26 Work Plan'!$F$8:$F$8)","v":""},{"$f":"IF(ISBLANK('FY25-26 Work Plan'!$E$9:$E$9),\"\",'FY25-26 Work Plan'!$E$9:$E$9)","v":"123 E Main St., Suite 100 \nAnytown, CA 90000"},{"$f":"IF(ISBLANK('FY25-26 Work Plan'!$L$9:$L$9),\"\",TEXT('FY25-26 Work Plan'!$L$9:$L$9,\"###-###-####\"))","v":"999-999-9999"},{"$f":"IF(ISBLANK('FY25-26 Work Plan'!$L$10:$L$10),\"\",'FY25-26 Work Plan'!$L$10:$L$10)","v":"www.abc1.org"},{"$f":"IF(ISBLANK('FY25-26 Work Plan'!$E$11:$E$11),\"\",'FY25-26 Work Plan'!$E$11:$E$11)","v":"123 E Main St., Suite 100 \nAnytown, CA 90000"},{"$f":"IF(ISBLANK('FY25-26 Work Plan'!$L$11:$L$11),\"\",TEXT('FY25-26 Work Plan'!$L$11:$L$11,\"###-###-####\"))","v":"999-999-9999"},{"$f":"IF(ISBLANK('FY25-26 Work Plan'!$L$12:$L$12),\"\",'FY25-26 Work Plan'!$L$12:$L$12)","v":"www.abc2.org"},{"$f":"IF(ISBLANK('FY25-26 Work Plan'!$E$15:$E$15),\"\",'FY25-26 Work Plan'!$E$15:$E$15)","v":"John/Jane Doe"},{"$f":"IF(ISBLANK('FY25-26 Work Plan'!$I$15:$I$15),\"\",TEXT('FY25-26 Work Plan'!$I$15:$I$15,\"###-###-####\"))","v":"213-555-1212"},{"$f":"IF(ISBLANK('FY25-26 Work Plan'!$L$15:$L$15),\"\",'FY25-26 Work Plan'!$L$15:$L$15)","v":"janedoe@preventionusa.com"},{"$f":"IF(ISBLANK('FY25-26 Work Plan'!$E$16:$E$16),\"\",'FY25-26 Work Plan'!$E$16:$E$16)","v":"John/Jane Doe"},{"$f":"IF(ISBLANK('FY25-26 Work Plan'!$I$16:$I$16),\"\",TEXT('FY25-26 Work Plan'!$I$16:$I$16,\"###-###-####\"))","v":"213-555-1212"},{"$f":"IF(ISBLANK('FY25-26 Work Plan'!$L$16:$L$16),\"\",'FY25-26 Work Plan'!$L$16:$L$16)","v":"janedoe@preventionusa.com"},{"$f":"IF(ISBLANK('FY25-26 Work Plan'!$E$17:$E$17),\"\",'FY25-26 Work Plan'!$E$17:$E$17)","v":"John/Jane Doe"},{"$f":"IF(ISBLANK('FY25-26 Work Plan'!$I$17:$I$17),\"\",TEXT('FY25-26 Work Plan'!$I$17:$I$17,\"###-###-####\"))","v":"213-555-1212"},{"$f":"IF(ISBLANK('FY25-26 Work Plan'!$L$17:$L$17),\"\",'FY25-26 Work Plan'!$L$17:$L$17)","v":"j.doe@preventionusa.com"},{"$f":"IF(ISBLANK('FY25-26 Work Plan'!$E$18:$E$18),\"\",'FY25-26 Work Plan'!$E$18:$E$18)","v":"John/Jane Doe"},{"$f":"IF(ISBLANK('FY25-26 Work Plan'!$I$18:$I$18),\"\",TEXT('FY25-26 Work Plan'!$I$18:$I$18,\"###-###-####\"))","v":"213-555-1213"},{"$f":"IF(ISBLANK('FY25-26 Work Plan'!$L$18:$L$18),\"\",'FY25-26 Work Plan'!$L$18:$L$18)","v":"j.doe@preventionusa.com"},{"$f":"IF(ISBLANK('FY25-26 Work Plan'!$E$19:$E$19),\"\",'FY25-26 Work Plan'!$E$19:$E$19)","v":"John/Jane Doe"},{"$f":"IF(ISBLANK('FY25-26 Work Plan'!$I$19:$I$19),\"\",TEXT('FY25-26 Work Plan'!$I$19:$I$19,\"###-###-####\"))","v":"213-555-1213"},{"$f":"IF(ISBLANK('FY25-26 Work Plan'!$L$19:$L$19),\"\",'FY25-26 Work Plan'!$L$19:$L$19)","v":"j.doe@preventionusa.com"},{"$f":"IF(ISBLANK('FY25-26 Work Plan'!$E$23:$E$23),\"\",'FY25-26 Work Plan'!$E$23:$E$23)","v":""},{"$f":"IF(ISBLANK('FY25-26 Work Plan'!$I$23:$I$23),\"\",'FY25-26 Work Plan'!$I$23:$I$23)","v":""},{"$f":"IF(ISBLANK('FY25-26 Work Plan'!$E$24:$E$24),\"\",'FY25-26 Work Plan'!$E$24:$E$24)","v":""},{"$f":"IF(ISBLANK('FY25-26 Work Plan'!$I$24:$I$24),\"\",'FY25-26 Work Plan'!$I$24:$I$24)","v":""},{"$f":"IF(ISBLANK('FY25-26 Work Plan'!$E$25:$E$25),\"\",'FY25-26 Work Plan'!$E$25:$E$25)","v":""},{"$f":"IF(ISBLANK('FY25-26 Work Plan'!$I$25:$I$25),\"\",'FY25-26 Work Plan'!$I$25:$I$25)","v":""},{"$f":"IF(ISBLANK('FY25-26 Work Plan'!$E$26:$E$26),\"\",'FY25-26 Work Plan'!$E$26:$E$26)","v":""},{"$f":"IF(ISBLANK('FY25-26 Work Plan'!$I$26:$I$26),\"\",'FY25-26 Work Plan'!$I$26:$I$26)","v":""},{"$f":"IF(ISBLANK('FY25-26 Work Plan'!$E$27:$E$27),\"\",'FY25-26 Work Plan'!$E$27:$E$27)","v":""},{"$f":"IF(ISBLANK('FY25-26 Work Plan'!$I$27:$I$27),\"\",'FY25-26 Work Plan'!$I$27:$I$27)","v":""},{"$f":"IF(ISBLANK('FY25-26 Work Plan'!$E$28:$E$28),\"\",'FY25-26 Work Plan'!$E$28:$E$28)","v":""},{"$f":"IF(ISBLANK('FY25-26 Work Plan'!$I$28:$I$28),\"\",'FY25-26 Work Plan'!$I$28:$I$28)","v":""},{"$f":"IF(ISBLANK('FY25-26 Work Plan'!$E$29:$E$29),\"\",'FY25-26 Work Plan'!$E$29:$E$29)","v":""},{"$f":"IF(ISBLANK('FY25-26 Work Plan'!$I$29:$I$29),\"\",'FY25-26 Work Plan'!$I$29:$I$29)","v":""},{"$f":"IF(ISBLANK('FY25-26 Work Plan'!$B$30:$B$30),\"\",'FY25-26 Work Plan'!$B$30:$B$30)","v":""},{"$f":"IF(ISBLANK('FY25-26 Work Plan'!$E$30:$E$30),\"\",'FY25-26 Work Plan'!$E$30:$E$30)","v":""},{"$f":"IF(ISBLANK('FY25-26 Work Plan'!$I$30:$I$30),\"\",'FY25-26 Work Plan'!$I$30:$I$30)","v":""},{"$f":"IF(ISBLANK('FY25-26 Work Plan'!$B$31:$B$31),\"\",'FY25-26 Work Plan'!$B$31:$B$31)","v":""},{"$f":"IF(ISBLANK('FY25-26 Work Plan'!$E$31:$E$31),\"\",'FY25-26 Work Plan'!$E$31:$E$31)","v":""},{"$f":"IF(ISBLANK('FY25-26 Work Plan'!$I$31:$I$31),\"\",'FY25-26 Work Plan'!$I$31:$I$31)","v":""},{"$f":"IF(ISBLANK('FY25-26 Work Plan'!$B$32:$B$32),\"\",'FY25-26 Work Plan'!$B$32:$B$32)","v":""},{"$f":"IF(ISBLANK('FY25-26 Work Plan'!$E$32:$E$32),\"\",'FY25-26 Work Plan'!$E$32:$E$32)","v":""},{"$f":"IF(ISBLANK('FY25-26 Work Plan'!$I$32:$I$32),\"\",'FY25-26 Work Plan'!$I$32:$I$32)","v":""},{"$f":"IF(ISBLANK('FY25-26 Work Plan'!#REF!),\"\",'FY25-26 Work Plan'!#REF!)","v":{"$error":"#REF!"}},{"$f":"IF(ISBLANK('FY25-26 Work Plan'!#REF!),\"\",'FY25-26 Work Plan'!#REF!)","v":{"$error":"#REF!"}},{"$f":"IF(ISBLANK('FY25-26 Work Plan'!#REF!),\"\",'FY25-26 Work Plan'!#REF!)","v":{"$error":"#REF!"}},{"$f":"IF(ISBLANK('FY25-26 Work Plan'!#REF!),\"\",'FY25-26 Work Plan'!#REF!)","v":{"$error":"#REF!"}},{"$f":"IF(ISBLANK('FY25-26 Work Plan'!#REF!),\"\",'FY25-26 Work Plan'!#REF!)","v":{"$error":"#REF!"}},{"$f":"IF(ISBLANK('FY25-26 Work Plan'!#REF!),\"\",'FY25-26 Work Plan'!#REF!)","v":{"$error":"#REF!"}},{"$f":"IF(ISBLANK('FY25-26 Work Plan'!#REF!),\"\",'FY25-26 Work Plan'!#REF!)","v":{"$error":"#REF!"}},{"$f":"IF(ISBLANK('FY25-26 Work Plan'!#REF!),\"\",'FY25-26 Work Plan'!#REF!)","v":{"$error":"#REF!"}},{"$f":"IF(ISBLANK('FY25-26 Work Plan'!#REF!),\"\",'FY25-26 Work Plan'!#REF!)","v":{"$error":"#REF!"}}]
[{"$f":"IF(ISBLANK('FY25-26 Work Plan'!$E$2:$E$2),\"\",'FY25-26 Work Plan'!$E$2:$E$2)","v":"Asian American Drug Abuse Programs, Inc. (AADAP)"},{"$f":"IF(ISBLANK('FY25-26 Work Plan'!$L$2:$L$2),\"\",'FY25-26 Work Plan'!$L$2:$L$2)","v":"Prevention Education Program (PEP)"},{"$f":"IF(ISBLANK('FY25-26 Work Plan'!$L$3:$L$3),\"\",'FY25-26 Work Plan'!$L$3:$L$3)","v":""},{"$f":"IF(ISBLANK('FY25-26 Work Plan'!$E$3:$E$3),\"\",'FY25-26 Work Plan'!$E$3:$E$3)","v":"PH-005150 "},{"$f":"IF(ISBLANK('FY25-26 Work Plan'!$E$4:$E$4),\"\",TEXT('FY25-26 Work Plan'!$E$4:$E$4,\"000000\"))","v":"000001"},{"$f":"IF(ISBLANK('FY25-26 Work Plan'!$L$4:$L$4),\"\",'FY25-26 Work Plan'!$L$4:$L$4)","v":""},{"$f":"IF(ISBLANK('FY25-26 Work Plan'!$E$5:$E$5),\"\",'FY25-26 Work Plan'!$E$5:$E$5)","v":"2 - San Fernando Valley"},{"$f":"IF(ISBLANK('FY25-26 Work Plan'!$L$5:$L$5),\"\",'FY25-26 Work Plan'!$L$5:$L$5)","v":""},{"$f":"IF(ISBLANK('FY25-26 Work Plan'!$E$6:$E$6),\"\",'FY25-26 Work Plan'!$E$6:$E$6)","v":"Agoura Hills, Agua Dulce*"},{"$f":"IF(ISBLANK('FY25-26 Work Plan'!$F$7:$F$7),\"\",'FY25-26 Work Plan'!$F$7:$F$7)","v":""},{"$f":"IF(ISBLANK('FY25-26 Work Plan'!$F$8:$F$8),\"\",'FY25-26 Work Plan'!$F$8:$F$8)","v":""},{"$f":"IF(ISBLANK('FY25-26 Work Plan'!$E$9:$E$9),\"\",'FY25-26 Work Plan'!$E$9:$E$9)","v":"123 E Main St., Suite 100 \nAnytown, CA 90000"},{"$f":"IF(ISBLANK('FY25-26 Work Plan'!$L$9:$L$9),\"\",TEXT('FY25-26 Work Plan'!$L$9:$L$9,\"###-###-####\"))","v":"999-999-9999"},{"$f":"IF(ISBLANK('FY25-26 Work Plan'!$L$10:$L$10),\"\",'FY25-26 Work Plan'!$L$10:$L$10)","v":"www.abc1.org"},{"$f":"IF(ISBLANK('FY25-26 Work Plan'!$E$11:$E$11),\"\",'FY25-26 Work Plan'!$E$11:$E$11)","v":"123 E Main St., Suite 100 \nAnytown, CA 90000"},{"$f":"IF(ISBLANK('FY25-26 Work Plan'!$L$11:$L$11),\"\",TEXT('FY25-26 Work Plan'!$L$11:$L$11,\"###-###-####\"))","v":"999-999-9999"},{"$f":"IF(ISBLANK('FY25-26 Work Plan'!$L$12:$L$12),\"\",'FY25-26 Work Plan'!$L$12:$L$12)","v":"www.abc2.org"},{"$f":"IF(ISBLANK('FY25-26 Work Plan'!$E$15:$E$15),\"\",'FY25-26 Work Plan'!$E$15:$E$15)","v":"John/Jane Doe"},{"$f":"IF(ISBLANK('FY25-26 Work Plan'!$I$15:$I$15),\"\",TEXT('FY25-26 Work Plan'!$I$15:$I$15,\"###-###-####\"))","v":"213-555-1212"},{"$f":"IF(ISBLANK('FY25-26 Work Plan'!$L$15:$L$15),\"\",'FY25-26 Work Plan'!$L$15:$L$15)","v":"janedoe@preventionusa.com"},{"$f":"IF(ISBLANK('FY25-26 Work Plan'!$E$16:$E$16),\"\",'FY25-26 Work Plan'!$E$16:$E$16)","v":"John/Jane Doe"},{"$f":"IF(ISBLANK('FY25-26 Work Plan'!$I$16:$I$16),\"\",TEXT('FY25-26 Work Plan'!$I$16:$I$16,\"###-###-####\"))","v":"213-555-1212"},{"$f":"IF(ISBLANK('FY25-26 Work Plan'!$L$16:$L$16),\"\",'FY25-26 Work Plan'!$L$16:$L$16)","v":"janedoe@preventionusa.com"},{"$f":"IF(ISBLANK('FY25-26 Work Plan'!$E$17:$E$17),\"\",'FY25-26 Work Plan'!$E$17:$E$17)","v":"John/Jane Doe"},{"$f":"IF(ISBLANK('FY25-26 Work Plan'!$I$17:$I$17),\"\",TEXT('FY25-26 Work Plan'!$I$17:$I$17,\"###-###-####\"))","v":"213-555-1212"},{"$f":"IF(ISBLANK('FY25-26 Work Plan'!$L$17:$L$17),\"\",'FY25-26 Work Plan'!$L$17:$L$17)","v":"j.doe@preventionusa.com"},{"$f":"IF(ISBLANK('FY25-26 Work Plan'!$E$18:$E$18),\"\",'FY25-26 Work Plan'!$E$18:$E$18)","v":"John/Jane Doe"},{"$f":"IF(ISBLANK('FY25-26 Work Plan'!$I$18:$I$18),\"\",TEXT('FY25-26 Work Plan'!$I$18:$I$18,\"###-###-####\"))","v":"213-555-1213"},{"$f":"IF(ISBLANK('FY25-26 Work Plan'!$L$18:$L$18),\"\",'FY25-26 Work Plan'!$L$18:$L$18)","v":"j.doe@preventionusa.com"},{"$f":"IF(ISBLANK('FY25-26 Work Plan'!$E$19:$E$19),\"\",'FY25-26 Work Plan'!$E$19:$E$19)","v":"John/Jane Doe"},{"$f":"IF(ISBLANK('FY25-26 Work Plan'!$I$19:$I$19),\"\",TEXT('FY25-26 Work Plan'!$I$19:$I$19,\"###-###-####\"))","v":"213-555-1213"},{"$f":"IF(ISBLANK('FY25-26 Work Plan'!$L$19:$L$19),\"\",'FY25-26 Work Plan'!$L$19:$L$19)","v":"j.doe@preventionusa.com"},{"$f":"IF(ISBLANK('FY25-26 Work Plan'!$E$23:$E$23),\"\",'FY25-26 Work Plan'!$E$23:$E$23)","v":""},{"$f":"IF(ISBLANK('FY25-26 Work Plan'!$I$23:$I$23),\"\",'FY25-26 Work Plan'!$I$23:$I$23)","v":""},{"$f":"IF(ISBLANK('FY25-26 Work Plan'!$E$24:$E$24),\"\",'FY25-26 Work Plan'!$E$24:$E$24)","v":""},{"$f":"IF(ISBLANK('FY25-26 Work Plan'!$I$24:$I$24),\"\",'FY25-26 Work Plan'!$I$24:$I$24)","v":""},{"$f":"IF(ISBLANK('FY25-26 Work Plan'!$E$25:$E$25),\"\",'FY25-26 Work Plan'!$E$25:$E$25)","v":""},{"$f":"IF(ISBLANK('FY25-26 Work Plan'!$I$25:$I$25),\"\",'FY25-26 Work Plan'!$I$25:$I$25)","v":""},{"$f":"IF(ISBLANK('FY25-26 Work Plan'!$E$26:$E$26),\"\",'FY25-26 Work Plan'!$E$26:$E$26)","v":""},{"$f":"IF(ISBLANK('FY25-26 Work Plan'!$I$26:$I$26),\"\",'FY25-26 Work Plan'!$I$26:$I$26)","v":""},{"$f":"IF(ISBLANK('FY25-26 Work Plan'!$E$27:$E$27),\"\",'FY25-26 Work Plan'!$E$27:$E$27)","v":""},{"$f":"IF(ISBLANK('FY25-26 Work Plan'!$I$27:$I$27),\"\",'FY25-26 Work Plan'!$I$27:$I$27)","v":""},{"$f":"IF(ISBLANK('FY25-26 Work Plan'!$E$28:$E$28),\"\",'FY25-26 Work Plan'!$E$28:$E$28)","v":""},{"$f":"IF(ISBLANK('FY25-26 Work Plan'!$I$28:$I$28),\"\",'FY25-26 Work Plan'!$I$28:$I$28)","v":""},{"$f":"IF(ISBLANK('FY25-26 Work Plan'!$E$29:$E$29),\"\",'FY25-26 Work Plan'!$E$29:$E$29)","v":""},{"$f":"IF(ISBLANK('FY25-26 Work Plan'!$I$29:$I$29),\"\",'FY25-26 Work Plan'!$I$29:$I$29)","v":""},{"$f":"IF(ISBLANK('FY25-26 Work Plan'!$B$30:$B$30),\"\",'FY25-26 Work Plan'!$B$30:$B$30)","v":""},{"$f":"IF(ISBLANK('FY25-26 Work Plan'!$E$30:$E$30),\"\",'FY25-26 Work Plan'!$E$30:$E$30)","v":""},{"$f":"IF(ISBLANK('FY25-26 Work Plan'!$I$30:$I$30),\"\",'FY25-26 Work Plan'!$I$30:$I$30)","v":""},{"$f":"IF(ISBLANK('FY25-26 Work Plan'!$B$31:$B$31),\"\",'FY25-26 Work Plan'!$B$31:$B$31)","v":""},{"$f":"IF(ISBLANK('FY25-26 Work Plan'!$E$31:$E$31),\"\",'FY25-26 Work Plan'!$E$31:$E$31)","v":""},{"$f":"IF(ISBLANK('FY25-26 Work Plan'!$I$31:$I$31),\"\",'FY25-26 Work Plan'!$I$31:$I$31)","v":""},{"$f":"IF(ISBLANK('FY25-26 Work Plan'!$B$32:$B$32),\"\",'FY25-26 Work Plan'!$B$32:$B$32)","v":""},{"$f":"IF(ISBLANK('FY25-26 Work Plan'!$E$32:$E$32),\"\",'FY25-26 Work Plan'!$E$32:$E$32)","v":""},{"$f":"IF(ISBLANK('FY25-26 Work Plan'!$I$32:$I$32),\"\",'FY25-26 Work Plan'!$I$32:$I$32)","v":""},{"$f":"IF(ISBLANK('FY25-26 Work Plan'!#REF!),\"\",'FY25-26 Work Plan'!#REF!)","v":{"$error":"#REF!"}},{"$f":"IF(ISBLANK('FY25-26 Work Plan'!#REF!),\"\",'FY25-26 Work Plan'!#REF!)","v":{"$error":"#REF!"}},{"$f":"IF(ISBLANK('FY25-26 Work Plan'!#REF!),\"\",'FY25-26 Work Plan'!#REF!)","v":{"$error":"#REF!"}},{"$f":"IF(ISBLANK('FY25-26 Work Plan'!#REF!),\"\",'FY25-26 Work Plan'!#REF!)","v":{"$error":"#REF!"}},{"$f":"IF(ISBLANK('FY25-26 Work Plan'!#REF!),\"\",'FY25-26 Work Plan'!#REF!)","v":{"$error":"#REF!"}},{"$f":"IF(ISBLANK('FY25-26 Work Plan'!#REF!),\"\",'FY25-26 Work Plan'!#REF!)","v":{"$error":"#REF!"}},{"$f":"IF(ISBLANK('FY25-26 Work Plan'!#REF!),\"\",'FY25-26 Work Plan'!#REF!)","v":{"$error":"#REF!"}},{"$f":"IF(ISBLANK('FY25-26 Work Plan'!#REF!),\"\",'FY25-26 Work Plan'!#REF!)","v":{"$error":"#REF!"}},{"$f":"IF(ISBLANK('FY25-26 Work Plan'!#REF!),\"\",'FY25-26 Work Plan'!#REF!)","v":{"$error":"#REF!"}}]
[{"$f":"IF(ISBLANK('FY25-26 Work Plan'!$E$2:$E$2),\"\",'FY25-26 Work Plan'!$E$2:$E$2)","v":"Asian American Drug Abuse Programs, Inc. (AADAP)"},{"$f":"IF(ISBLANK('FY25-26 Work Plan'!$L$2:$L$2),\"\",'FY25-26 Work Plan'!$L$2:$L$2)","v":"Prevention Education Program (PEP)"},{"$f":"IF(ISBLANK('FY25-26 Work Plan'!$L$3:$L$3),\"\",'FY25-26 Work Plan'!$L$3:$L$3)","v":""},{"$f":"IF(ISBLANK('FY25-26 Work Plan'!$E$3:$E$3),\"\",'FY25-26 Work Plan'!$E$3:$E$3)","v":"PH-005150 "},{"$f":"IF(ISBLANK('FY25-26 Work Plan'!$E$4:$E$4),\"\",TEXT('FY25-26 Work Plan'!$E$4:$E$4,\"000000\"))","v":"000001"},{"$f":"IF(ISBLANK('FY25-26 Work Plan'!$L$4:$L$4),\"\",'FY25-26 Work Plan'!$L$4:$L$4)","v":""},{"$f":"IF(ISBLANK('FY25-26 Work Plan'!$E$5:$E$5),\"\",'FY25-26 Work Plan'!$E$5:$E$5)","v":"2 - San Fernando Valley"},{"$f":"IF(ISBLANK('FY25-26 Work Plan'!$L$5:$L$5),\"\",'FY25-26 Work Plan'!$L$5:$L$5)","v":""},{"$f":"IF(ISBLANK('FY25-26 Work Plan'!$E$6:$E$6),\"\",'FY25-26 Work Plan'!$E$6:$E$6)","v":"Agoura Hills, Agua Dulce*"},{"$f":"IF(ISBLANK('FY25-26 Work Plan'!$F$7:$F$7),\"\",'FY25-26 Work Plan'!$F$7:$F$7)","v":""},{"$f":"IF(ISBLANK('FY25-26 Work Plan'!$F$8:$F$8),\"\",'FY25-26 Work Plan'!$F$8:$F$8)","v":""},{"$f":"IF(ISBLANK('FY25-26 Work Plan'!$E$9:$E$9),\"\",'FY25-26 Work Plan'!$E$9:$E$9)","v":"123 E Main St., Suite 100 \nAnytown, CA 90000"},{"$f":"IF(ISBLANK('FY25-26 Work Plan'!$L$9:$L$9),\"\",TEXT('FY25-26 Work Plan'!$L$9:$L$9,\"###-###-####\"))","v":"999-999-9999"},{"$f":"IF(ISBLANK('FY25-26 Work Plan'!$L$10:$L$10),\"\",'FY25-26 Work Plan'!$L$10:$L$10)","v":"www.abc1.org"},{"$f":"IF(ISBLANK('FY25-26 Work Plan'!$E$11:$E$11),\"\",'FY25-26 Work Plan'!$E$11:$E$11)","v":"123 E Main St., Suite 100 \nAnytown, CA 90000"},{"$f":"IF(ISBLANK('FY25-26 Work Plan'!$L$11:$L$11),\"\",TEXT('FY25-26 Work Plan'!$L$11:$L$11,\"###-###-####\"))","v":"999-999-9999"},{"$f":"IF(ISBLANK('FY25-26 Work Plan'!$L$12:$L$12),\"\",'FY25-26 Work Plan'!$L$12:$L$12)","v":"www.abc2.org"},{"$f":"IF(ISBLANK('FY25-26 Work Plan'!$E$15:$E$15),\"\",'FY25-26 Work Plan'!$E$15:$E$15)","v":"John/Jane Doe"},{"$f":"IF(ISBLANK('FY25-26 Work Plan'!$I$15:$I$15),\"\",TEXT('FY25-26 Work Plan'!$I$15:$I$15,\"###-###-####\"))","v":"213-555-1212"},{"$f":"IF(ISBLANK('FY25-26 Work Plan'!$L$15:$L$15),\"\",'FY25-26 Work Plan'!$L$15:$L$15)","v":"janedoe@preventionusa.com"},{"$f":"IF(ISBLANK('FY25-26 Work Plan'!$E$16:$E$16),\"\",'FY25-26 Work Plan'!$E$16:$E$16)","v":"John/Jane Doe"},{"$f":"IF(ISBLANK('FY25-26 Work Plan'!$I$16:$I$16),\"\",TEXT('FY25-26 Work Plan'!$I$16:$I$16,\"###-###-####\"))","v":"213-555-1212"},{"$f":"IF(ISBLANK('FY25-26 Work Plan'!$L$16:$L$16),\"\",'FY25-26 Work Plan'!$L$16:$L$16)","v":"janedoe@preventionusa.com"},{"$f":"IF(ISBLANK('FY25-26 Work Plan'!$E$17:$E$17),\"\",'FY25-26 Work Plan'!$E$17:$E$17)","v":"John/Jane Doe"},{"$f":"IF(ISBLANK('FY25-26 Work Plan'!$I$17:$I$17),\"\",TEXT('FY25-26 Work Plan'!$I$17:$I$17,\"###-###-####\"))","v":"213-555-1212"},{"$f":"IF(ISBLANK('FY25-26 Work Plan'!$L$17:$L$17),\"\",'FY25-26 Work Plan'!$L$17:$L$17)","v":"j.doe@preventionusa.com"},{"$f":"IF(ISBLANK('FY25-26 Work Plan'!$E$18:$E$18),\"\",'FY25-26 Work Plan'!$E$18:$E$18)","v":"John/Jane Doe"},{"$f":"IF(ISBLANK('FY25-26 Work Plan'!$I$18:$I$18),\"\",TEXT('FY25-26 Work Plan'!$I$18:$I$18,\"###-###-####\"))","v":"213-555-1213"},{"$f":"IF(ISBLANK('FY25-26 Work Plan'!$L$18:$L$18),\"\",'FY25-26 Work Plan'!$L$18:$L$18)","v":"j.doe@preventionusa.com"},{"$f":"IF(ISBLANK('FY25-26 Work Plan'!$E$19:$E$19),\"\",'FY25-26 Work Plan'!$E$19:$E$19)","v":"John/Jane Doe"},{"$f":"IF(ISBLANK('FY25-26 Work Plan'!$I$19:$I$19),\"\",TEXT('FY25-26 Work Plan'!$I$19:$I$19,\"###-###-####\"))","v":"213-555-1213"},{"$f":"IF(ISBLANK('FY25-26 Work Plan'!$L$19:$L$19),\"\",'FY25-26 Work Plan'!$L$19:$L$19)","v":"j.doe@preventionusa.com"},{"$f":"IF(ISBLANK('FY25-26 Work Plan'!$E$23:$E$23),\"\",'FY25-26 Work Plan'!$E$23:$E$23)","v":""},{"$f":"IF(ISBLANK('FY25-26 Work Plan'!$I$23:$I$23),\"\",'FY25-26 Work Plan'!$I$23:$I$23)","v":""},{"$f":"IF(ISBLANK('FY25-26 Work Plan'!$E$24:$E$24),\"\",'FY25-26 Work Plan'!$E$24:$E$24)","v":""},{"$f":"IF(ISBLANK('FY25-26 Work Plan'!$I$24:$I$24),\"\",'FY25-26 Work Plan'!$I$24:$I$24)","v":""},{"$f":"IF(ISBLANK('FY25-26 Work Plan'!$E$25:$E$25),\"\",'FY25-26 Work Plan'!$E$25:$E$25)","v":""},{"$f":"IF(ISBLANK('FY25-26 Work Plan'!$I$25:$I$25),\"\",'FY25-26 Work Plan'!$I$25:$I$25)","v":""},{"$f":"IF(ISBLANK('FY25-26 Work Plan'!$E$26:$E$26),\"\",'FY25-26 Work Plan'!$E$26:$E$26)","v":""},{"$f":"IF(ISBLANK('FY25-26 Work Plan'!$I$26:$I$26),\"\",'FY25-26 Work Plan'!$I$26:$I$26)","v":""},{"$f":"IF(ISBLANK('FY25-26 Work Plan'!$E$27:$E$27),\"\",'FY25-26 Work Plan'!$E$27:$E$27)","v":""},{"$f":"IF(ISBLANK('FY25-26 Work Plan'!$I$27:$I$27),\"\",'FY25-26 Work Plan'!$I$27:$I$27)","v":""},{"$f":"IF(ISBLANK('FY25-26 Work Plan'!$E$28:$E$28),\"\",'FY25-26 Work Plan'!$E$28:$E$28)","v":""},{"$f":"IF(ISBLANK('FY25-26 Work Plan'!$I$28:$I$28),\"\",'FY25-26 Work Plan'!$I$28:$I$28)","v":""},{"$f":"IF(ISBLANK('FY25-26 Work Plan'!$E$29:$E$29),\"\",'FY25-26 Work Plan'!$E$29:$E$29)","v":""},{"$f":"IF(ISBLANK('FY25-26 Work Plan'!$I$29:$I$29),\"\",'FY25-26 Work Plan'!$I$29:$I$29)","v":""},{"$f":"IF(ISBLANK('FY25-26 Work Plan'!$B$30:$B$30),\"\",'FY25-26 Work Plan'!$B$30:$B$30)","v":""},{"$f":"IF(ISBLANK('FY25-26 Work Plan'!$E$30:$E$30),\"\",'FY25-26 Work Plan'!$E$30:$E$30)","v":""},{"$f":"IF(ISBLANK('FY25-26 Work Plan'!$I$30:$I$30),\"\",'FY25-26 Work Plan'!$I$30:$I$30)","v":""},{"$f":"IF(ISBLANK('FY25-26 Work Plan'!$B$31:$B$31),\"\",'FY25-26 Work Plan'!$B$31:$B$31)","v":""},{"$f":"IF(ISBLANK('FY25-26 Work Plan'!$E$31:$E$31),\"\",'FY25-26 Work Plan'!$E$31:$E$31)","v":""},{"$f":"IF(ISBLANK('FY25-26 Work Plan'!$I$31:$I$31),\"\",'FY25-26 Work Plan'!$I$31:$I$31)","v":""},{"$f":"IF(ISBLANK('FY25-26 Work Plan'!$B$32:$B$32),\"\",'FY25-26 Work Plan'!$B$32:$B$32)","v":""},{"$f":"IF(ISBLANK('FY25-26 Work Plan'!$E$32:$E$32),\"\",'FY25-26 Work Plan'!$E$32:$E$32)","v":""},{"$f":"IF(ISBLANK('FY25-26 Work Plan'!$I$32:$I$32),\"\",'FY25-26 Work Plan'!$I$32:$I$32)","v":""},{"$f":"IF(ISBLANK('FY25-26 Work Plan'!#REF!),\"\",'FY25-26 Work Plan'!#REF!)","v":{"$error":"#REF!"}},{"$f":"IF(ISBLANK('FY25-26 Work Plan'!#REF!),\"\",'FY25-26 Work Plan'!#REF!)","v":{"$error":"#REF!"}},{"$f":"IF(ISBLANK('FY25-26 Work Plan'!#REF!),\"\",'FY25-26 Work Plan'!#REF!)","v":{"$error":"#REF!"}},{"$f":"IF(ISBLANK('FY25-26 Work Plan'!#REF!),\"\",'FY25-26 Work Plan'!#REF!)","v":{"$error":"#REF!"}},{"$f":"IF(ISBLANK('FY25-26 Work Plan'!#REF!),\"\",'FY25-26 Work Plan'!#REF!)","v":{"$error":"#REF!"}},{"$f":"IF(ISBLANK('FY25-26 Work Plan'!#REF!),\"\",'FY25-26 Work Plan'!#REF!)","v":{"$error":"#REF!"}},{"$f":"IF(ISBLANK('FY25-26 Work Plan'!#REF!),\"\",'FY25-26 Work Plan'!#REF!)","v":{"$error":"#REF!"}},{"$f":"IF(ISBLANK('FY25-26 Work Plan'!#REF!),\"\",'FY25-26 Work Plan'!#REF!)","v":{"$error":"#REF!"}},{"$f":"IF(ISBLANK('FY25-26 Work Plan'!#REF!),\"\",'FY25-26 Work Plan'!#REF!)","v":{"$error":"#REF!"}}]
[{"$f":"IF(ISBLANK('FY25-26 Work Plan'!$E$2:$E$2),\"\",'FY25-26 Work Plan'!$E$2:$E$2)","v":"Asian American Drug Abuse Programs, Inc. (AADAP)"},{"$f":"IF(ISBLANK('FY25-26 Work Plan'!$L$2:$L$2),\"\",'FY25-26 Work Plan'!$L$2:$L$2)","v":"Prevention Education Program (PEP)"},{"$f":"IF(ISBLANK('FY25-26 Work Plan'!$L$3:$L$3),\"\",'FY25-26 Work Plan'!$L$3:$L$3)","v":""},{"$f":"IF(ISBLANK('FY25-26 Work Plan'!$E$3:$E$3),\"\",'FY25-26 Work Plan'!$E$3:$E$3)","v":"PH-005150 "},{"$f":"IF(ISBLANK('FY25-26 Work Plan'!$E$4:$E$4),\"\",TEXT('FY25-26 Work Plan'!$E$4:$E$4,\"000000\"))","v":"000001"},{"$f":"IF(ISBLANK('FY25-26 Work Plan'!$L$4:$L$4),\"\",'FY25-26 Work Plan'!$L$4:$L$4)","v":""},{"$f":"IF(ISBLANK('FY25-26 Work Plan'!$E$5:$E$5),\"\",'FY25-26 Work Plan'!$E$5:$E$5)","v":"2 - San Fernando Valley"},{"$f":"IF(ISBLANK('FY25-26 Work Plan'!$L$5:$L$5),\"\",'FY25-26 Work Plan'!$L$5:$L$5)","v":""},{"$f":"IF(ISBLANK('FY25-26 Work Plan'!$E$6:$E$6),\"\",'FY25-26 Work Plan'!$E$6:$E$6)","v":"Agoura Hills, Agua Dulce*"},{"$f":"IF(ISBLANK('FY25-26 Work Plan'!$F$7:$F$7),\"\",'FY25-26 Work Plan'!$F$7:$F$7)","v":""},{"$f":"IF(ISBLANK('FY25-26 Work Plan'!$F$8:$F$8),\"\",'FY25-26 Work Plan'!$F$8:$F$8)","v":""},{"$f":"IF(ISBLANK('FY25-26 Work Plan'!$E$9:$E$9),\"\",'FY25-26 Work Plan'!$E$9:$E$9)","v":"123 E Main St., Suite 100 \nAnytown, CA 90000"},{"$f":"IF(ISBLANK('FY25-26 Work Plan'!$L$9:$L$9),\"\",TEXT('FY25-26 Work Plan'!$L$9:$L$9,\"###-###-####\"))","v":"999-999-9999"},{"$f":"IF(ISBLANK('FY25-26 Work Plan'!$L$10:$L$10),\"\",'FY25-26 Work Plan'!$L$10:$L$10)","v":"www.abc1.org"},{"$f":"IF(ISBLANK('FY25-26 Work Plan'!$E$11:$E$11),\"\",'FY25-26 Work Plan'!$E$11:$E$11)","v":"123 E Main St., Suite 100 \nAnytown, CA 90000"},{"$f":"IF(ISBLANK('FY25-26 Work Plan'!$L$11:$L$11),\"\",TEXT('FY25-26 Work Plan'!$L$11:$L$11,\"###-###-####\"))","v":"999-999-9999"},{"$f":"IF(ISBLANK('FY25-26 Work Plan'!$L$12:$L$12),\"\",'FY25-26 Work Plan'!$L$12:$L$12)","v":"www.abc2.org"},{"$f":"IF(ISBLANK('FY25-26 Work Plan'!$E$15:$E$15),\"\",'FY25-26 Work Plan'!$E$15:$E$15)","v":"John/Jane Doe"},{"$f":"IF(ISBLANK('FY25-26 Work Plan'!$I$15:$I$15),\"\",TEXT('FY25-26 Work Plan'!$I$15:$I$15,\"###-###-####\"))","v":"213-555-1212"},{"$f":"IF(ISBLANK('FY25-26 Work Plan'!$L$15:$L$15),\"\",'FY25-26 Work Plan'!$L$15:$L$15)","v":"janedoe@preventionusa.com"},{"$f":"IF(ISBLANK('FY25-26 Work Plan'!$E$16:$E$16),\"\",'FY25-26 Work Plan'!$E$16:$E$16)","v":"John/Jane Doe"},{"$f":"IF(ISBLANK('FY25-26 Work Plan'!$I$16:$I$16),\"\",TEXT('FY25-26 Work Plan'!$I$16:$I$16,\"###-###-####\"))","v":"213-555-1212"},{"$f":"IF(ISBLANK('FY25-26 Work Plan'!$L$16:$L$16),\"\",'FY25-26 Work Plan'!$L$16:$L$16)","v":"janedoe@preventionusa.com"},{"$f":"IF(ISBLANK('FY25-26 Work Plan'!$E$17:$E$17),\"\",'FY25-26 Work Plan'!$E$17:$E$17)","v":"John/Jane Doe"},{"$f":"IF(ISBLANK('FY25-26 Work Plan'!$I$17:$I$17),\"\",TEXT('FY25-26 Work Plan'!$I$17:$I$17,\"###-###-####\"))","v":"213-555-1212"},{"$f":"IF(ISBLANK('FY25-26 Work Plan'!$L$17:$L$17),\"\",'FY25-26 Work Plan'!$L$17:$L$17)","v":"j.doe@preventionusa.com"},{"$f":"IF(ISBLANK('FY25-26 Work Plan'!$E$18:$E$18),\"\",'FY25-26 Work Plan'!$E$18:$E$18)","v":"John/Jane Doe"},{"$f":"IF(ISBLANK('FY25-26 Work Plan'!$I$18:$I$18),\"\",TEXT('FY25-26 Work Plan'!$I$18:$I$18,\"###-###-####\"))","v":"213-555-1213"},{"$f":"IF(ISBLANK('FY25-26 Work Plan'!$L$18:$L$18),\"\",'FY25-26 Work Plan'!$L$18:$L$18)","v":"j.doe@preventionusa.com"},{"$f":"IF(ISBLANK('FY25-26 Work Plan'!$E$19:$E$19),\"\",'FY25-26 Work Plan'!$E$19:$E$19)","v":"John/Jane Doe"},{"$f":"IF(ISBLANK('FY25-26 Work Plan'!$I$19:$I$19),\"\",TEXT('FY25-26 Work Plan'!$I$19:$I$19,\"###-###-####\"))","v":"213-555-1213"},{"$f":"IF(ISBLANK('FY25-26 Work Plan'!$L$19:$L$19),\"\",'FY25-26 Work Plan'!$L$19:$L$19)","v":"j.doe@preventionusa.com"},{"$f":"IF(ISBLANK('FY25-26 Work Plan'!$E$23:$E$23),\"\",'FY25-26 Work Plan'!$E$23:$E$23)","v":""},{"$f":"IF(ISBLANK('FY25-26 Work Plan'!$I$23:$I$23),\"\",'FY25-26 Work Plan'!$I$23:$I$23)","v":""},{"$f":"IF(ISBLANK('FY25-26 Work Plan'!$E$24:$E$24),\"\",'FY25-26 Work Plan'!$E$24:$E$24)","v":""},{"$f":"IF(ISBLANK('FY25-26 Work Plan'!$I$24:$I$24),\"\",'FY25-26 Work Plan'!$I$24:$I$24)","v":""},{"$f":"IF(ISBLANK('FY25-26 Work Plan'!$E$25:$E$25),\"\",'FY25-26 Work Plan'!$E$25:$E$25)","v":""},{"$f":"IF(ISBLANK('FY25-26 Work Plan'!$I$25:$I$25),\"\",'FY25-26 Work Plan'!$I$25:$I$25)","v":""},{"$f":"IF(ISBLANK('FY25-26 Work Plan'!$E$26:$E$26),\"\",'FY25-26 Work Plan'!$E$26:$E$26)","v":""},{"$f":"IF(ISBLANK('FY25-26 Work Plan'!$I$26:$I$26),\"\",'FY25-26 Work Plan'!$I$26:$I$26)","v":""},{"$f":"IF(ISBLANK('FY25-26 Work Plan'!$E$27:$E$27),\"\",'FY25-26 Work Plan'!$E$27:$E$27)","v":""},{"$f":"IF(ISBLANK('FY25-26 Work Plan'!$I$27:$I$27),\"\",'FY25-26 Work Plan'!$I$27:$I$27)","v":""},{"$f":"IF(ISBLANK('FY25-26 Work Plan'!$E$28:$E$28),\"\",'FY25-26 Work Plan'!$E$28:$E$28)","v":""},{"$f":"IF(ISBLANK('FY25-26 Work Plan'!$I$28:$I$28),\"\",'FY25-26 Work Plan'!$I$28:$I$28)","v":""},{"$f":"IF(ISBLANK('FY25-26 Work Plan'!$E$29:$E$29),\"\",'FY25-26 Work Plan'!$E$29:$E$29)","v":""},{"$f":"IF(ISBLANK('FY25-26 Work Plan'!$I$29:$I$29),\"\",'FY25-26 Work Plan'!$I$29:$I$29)","v":""},{"$f":"IF(ISBLANK('FY25-26 Work Plan'!$B$30:$B$30),\"\",'FY25-26 Work Plan'!$B$30:$B$30)","v":""},{"$f":"IF(ISBLANK('FY25-26 Work Plan'!$E$30:$E$30),\"\",'FY25-26 Work Plan'!$E$30:$E$30)","v":""},{"$f":"IF(ISBLANK('FY25-26 Work Plan'!$I$30:$I$30),\"\",'FY25-26 Work Plan'!$I$30:$I$30)","v":""},{"$f":"IF(ISBLANK('FY25-26 Work Plan'!$B$31:$B$31),\"\",'FY25-26 Work Plan'!$B$31:$B$31)","v":""},{"$f":"IF(ISBLANK('FY25-26 Work Plan'!$E$31:$E$31),\"\",'FY25-26 Work Plan'!$E$31:$E$31)","v":""},{"$f":"IF(ISBLANK('FY25-26 Work Plan'!$I$31:$I$31),\"\",'FY25-26 Work Plan'!$I$31:$I$31)","v":""},{"$f":"IF(ISBLANK('FY25-26 Work Plan'!$B$32:$B$32),\"\",'FY25-26 Work Plan'!$B$32:$B$32)","v":""},{"$f":"IF(ISBLANK('FY25-26 Work Plan'!$E$32:$E$32),\"\",'FY25-26 Work Plan'!$E$32:$E$32)","v":""},{"$f":"IF(ISBLANK('FY25-26 Work Plan'!$I$32:$I$32),\"\",'FY25-26 Work Plan'!$I$32:$I$32)","v":""},{"$f":"IF(ISBLANK('FY25-26 Work Plan'!#REF!),\"\",'FY25-26 Work Plan'!#REF!)","v":{"$error":"#REF!"}},{"$f":"IF(ISBLANK('FY25-26 Work Plan'!#REF!),\"\",'FY25-26 Work Plan'!#REF!)","v":{"$error":"#REF!"}},{"$f":"IF(ISBLANK('FY25-26 Work Plan'!#REF!),\"\",'FY25-26 Work Plan'!#REF!)","v":{"$error":"#REF!"}},{"$f":"IF(ISBLANK('FY25-26 Work Plan'!#REF!),\"\",'FY25-26 Work Plan'!#REF!)","v":{"$error":"#REF!"}},{"$f":"IF(ISBLANK('FY25-26 Work Plan'!#REF!),\"\",'FY25-26 Work Plan'!#REF!)","v":{"$error":"#REF!"}},{"$f":"IF(ISBLANK('FY25-26 Work Plan'!#REF!),\"\",'FY25-26 Work Plan'!#REF!)","v":{"$error":"#REF!"}},{"$f":"IF(ISBLANK('FY25-26 Work Plan'!#REF!),\"\",'FY25-26 Work Plan'!#REF!)","v":{"$error":"#REF!"}},{"$f":"IF(ISBLANK('FY25-26 Work Plan'!#REF!),\"\",'FY25-26 Work Plan'!#REF!)","v":{"$error":"#REF!"}},{"$f":"IF(ISBLANK('FY25-26 Work Plan'!#REF!),\"\",'FY25-26 Work Plan'!#REF!)","v":{"$error":"#REF!"}}]
[{"$f":"IF(ISBLANK('FY25-26 Work Plan'!$E$2:$E$2),\"\",'FY25-26 Work Plan'!$E$2:$E$2)","v":"Asian American Drug Abuse Programs, Inc. (AADAP)"},{"$f":"IF(ISBLANK('FY25-26 Work Plan'!$L$2:$L$2),\"\",'FY25-26 Work Plan'!$L$2:$L$2)","v":"Prevention Education Program (PEP)"},{"$f":"IF(ISBLANK('FY25-26 Work Plan'!$L$3:$L$3),\"\",'FY25-26 Work Plan'!$L$3:$L$3)","v":""},{"$f":"IF(ISBLANK('FY25-26 Work Plan'!$E$3:$E$3),\"\",'FY25-26 Work Plan'!$E$3:$E$3)","v":"PH-005150 "},{"$f":"IF(ISBLANK('FY25-26 Work Plan'!$E$4:$E$4),\"\",TEXT('FY25-26 Work Plan'!$E$4:$E$4,\"000000\"))","v":"000001"},{"$f":"IF(ISBLANK('FY25-26 Work Plan'!$L$4:$L$4),\"\",'FY25-26 Work Plan'!$L$4:$L$4)","v":""},{"$f":"IF(ISBLANK('FY25-26 Work Plan'!$E$5:$E$5),\"\",'FY25-26 Work Plan'!$E$5:$E$5)","v":"2 - San Fernando Valley"},{"$f":"IF(ISBLANK('FY25-26 Work Plan'!$L$5:$L$5),\"\",'FY25-26 Work Plan'!$L$5:$L$5)","v":""},{"$f":"IF(ISBLANK('FY25-26 Work Plan'!$E$6:$E$6),\"\",'FY25-26 Work Plan'!$E$6:$E$6)","v":"Agoura Hills, Agua Dulce*"},{"$f":"IF(ISBLANK('FY25-26 Work Plan'!$F$7:$F$7),\"\",'FY25-26 Work Plan'!$F$7:$F$7)","v":""},{"$f":"IF(ISBLANK('FY25-26 Work Plan'!$F$8:$F$8),\"\",'FY25-26 Work Plan'!$F$8:$F$8)","v":""},{"$f":"IF(ISBLANK('FY25-26 Work Plan'!$E$9:$E$9),\"\",'FY25-26 Work Plan'!$E$9:$E$9)","v":"123 E Main St., Suite 100 \nAnytown, CA 90000"},{"$f":"IF(ISBLANK('FY25-26 Work Plan'!$L$9:$L$9),\"\",TEXT('FY25-26 Work Plan'!$L$9:$L$9,\"###-###-####\"))","v":"999-999-9999"},{"$f":"IF(ISBLANK('FY25-26 Work Plan'!$L$10:$L$10),\"\",'FY25-26 Work Plan'!$L$10:$L$10)","v":"www.abc1.org"},{"$f":"IF(ISBLANK('FY25-26 Work Plan'!$E$11:$E$11),\"\",'FY25-26 Work Plan'!$E$11:$E$11)","v":"123 E Main St., Suite 100 \nAnytown, CA 90000"},{"$f":"IF(ISBLANK('FY25-26 Work Plan'!$L$11:$L$11),\"\",TEXT('FY25-26 Work Plan'!$L$11:$L$11,\"###-###-####\"))","v":"999-999-9999"},{"$f":"IF(ISBLANK('FY25-26 Work Plan'!$L$12:$L$12),\"\",'FY25-26 Work Plan'!$L$12:$L$12)","v":"www.abc2.org"},{"$f":"IF(ISBLANK('FY25-26 Work Plan'!$E$15:$E$15),\"\",'FY25-26 Work Plan'!$E$15:$E$15)","v":"John/Jane Doe"},{"$f":"IF(ISBLANK('FY25-26 Work Plan'!$I$15:$I$15),\"\",TEXT('FY25-26 Work Plan'!$I$15:$I$15,\"###-###-####\"))","v":"213-555-1212"},{"$f":"IF(ISBLANK('FY25-26 Work Plan'!$L$15:$L$15),\"\",'FY25-26 Work Plan'!$L$15:$L$15)","v":"janedoe@preventionusa.com"},{"$f":"IF(ISBLANK('FY25-26 Work Plan'!$E$16:$E$16),\"\",'FY25-26 Work Plan'!$E$16:$E$16)","v":"John/Jane Doe"},{"$f":"IF(ISBLANK('FY25-26 Work Plan'!$I$16:$I$16),\"\",TEXT('FY25-26 Work Plan'!$I$16:$I$16,\"###-###-####\"))","v":"213-555-1212"},{"$f":"IF(ISBLANK('FY25-26 Work Plan'!$L$16:$L$16),\"\",'FY25-26 Work Plan'!$L$16:$L$16)","v":"janedoe@preventionusa.com"},{"$f":"IF(ISBLANK('FY25-26 Work Plan'!$E$17:$E$17),\"\",'FY25-26 Work Plan'!$E$17:$E$17)","v":"John/Jane Doe"},{"$f":"IF(ISBLANK('FY25-26 Work Plan'!$I$17:$I$17),\"\",TEXT('FY25-26 Work Plan'!$I$17:$I$17,\"###-###-####\"))","v":"213-555-1212"},{"$f":"IF(ISBLANK('FY25-26 Work Plan'!$L$17:$L$17),\"\",'FY25-26 Work Plan'!$L$17:$L$17)","v":"j.doe@preventionusa.com"},{"$f":"IF(ISBLANK('FY25-26 Work Plan'!$E$18:$E$18),\"\",'FY25-26 Work Plan'!$E$18:$E$18)","v":"John/Jane Doe"},{"$f":"IF(ISBLANK('FY25-26 Work Plan'!$I$18:$I$18),\"\",TEXT('FY25-26 Work Plan'!$I$18:$I$18,\"###-###-####\"))","v":"213-555-1213"},{"$f":"IF(ISBLANK('FY25-26 Work Plan'!$L$18:$L$18),\"\",'FY25-26 Work Plan'!$L$18:$L$18)","v":"j.doe@preventionusa.com"},{"$f":"IF(ISBLANK('FY25-26 Work Plan'!$E$19:$E$19),\"\",'FY25-26 Work Plan'!$E$19:$E$19)","v":"John/Jane Doe"},{"$f":"IF(ISBLANK('FY25-26 Work Plan'!$I$19:$I$19),\"\",TEXT('FY25-26 Work Plan'!$I$19:$I$19,\"###-###-####\"))","v":"213-555-1213"},{"$f":"IF(ISBLANK('FY25-26 Work Plan'!$L$19:$L$19),\"\",'FY25-26 Work Plan'!$L$19:$L$19)","v":"j.doe@preventionusa.com"},{"$f":"IF(ISBLANK('FY25-26 Work Plan'!$E$23:$E$23),\"\",'FY25-26 Work Plan'!$E$23:$E$23)","v":""},{"$f":"IF(ISBLANK('FY25-26 Work Plan'!$I$23:$I$23),\"\",'FY25-26 Work Plan'!$I$23:$I$23)","v":""},{"$f":"IF(ISBLANK('FY25-26 Work Plan'!$E$24:$E$24),\"\",'FY25-26 Work Plan'!$E$24:$E$24)","v":""},{"$f":"IF(ISBLANK('FY25-26 Work Plan'!$I$24:$I$24),\"\",'FY25-26 Work Plan'!$I$24:$I$24)","v":""},{"$f":"IF(ISBLANK('FY25-26 Work Plan'!$E$25:$E$25),\"\",'FY25-26 Work Plan'!$E$25:$E$25)","v":""},{"$f":"IF(ISBLANK('FY25-26 Work Plan'!$I$25:$I$25),\"\",'FY25-26 Work Plan'!$I$25:$I$25)","v":""},{"$f":"IF(ISBLANK('FY25-26 Work Plan'!$E$26:$E$26),\"\",'FY25-26 Work Plan'!$E$26:$E$26)","v":""},{"$f":"IF(ISBLANK('FY25-26 Work Plan'!$I$26:$I$26),\"\",'FY25-26 Work Plan'!$I$26:$I$26)","v":""},{"$f":"IF(ISBLANK('FY25-26 Work Plan'!$E$27:$E$27),\"\",'FY25-26 Work Plan'!$E$27:$E$27)","v":""},{"$f":"IF(ISBLANK('FY25-26 Work Plan'!$I$27:$I$27),\"\",'FY25-26 Work Plan'!$I$27:$I$27)","v":""},{"$f":"IF(ISBLANK('FY25-26 Work Plan'!$E$28:$E$28),\"\",'FY25-26 Work Plan'!$E$28:$E$28)","v":""},{"$f":"IF(ISBLANK('FY25-26 Work Plan'!$I$28:$I$28),\"\",'FY25-26 Work Plan'!$I$28:$I$28)","v":""},{"$f":"IF(ISBLANK('FY25-26 Work Plan'!$E$29:$E$29),\"\",'FY25-26 Work Plan'!$E$29:$E$29)","v":""},{"$f":"IF(ISBLANK('FY25-26 Work Plan'!$I$29:$I$29),\"\",'FY25-26 Work Plan'!$I$29:$I$29)","v":""},{"$f":"IF(ISBLANK('FY25-26 Work Plan'!$B$30:$B$30),\"\",'FY25-26 Work Plan'!$B$30:$B$30)","v":""},{"$f":"IF(ISBLANK('FY25-26 Work Plan'!$E$30:$E$30),\"\",'FY25-26 Work Plan'!$E$30:$E$30)","v":""},{"$f":"IF(ISBLANK('FY25-26 Work Plan'!$I$30:$I$30),\"\",'FY25-26 Work Plan'!$I$30:$I$30)","v":""},{"$f":"IF(ISBLANK('FY25-26 Work Plan'!$B$31:$B$31),\"\",'FY25-26 Work Plan'!$B$31:$B$31)","v":""},{"$f":"IF(ISBLANK('FY25-26 Work Plan'!$E$31:$E$31),\"\",'FY25-26 Work Plan'!$E$31:$E$31)","v":""},{"$f":"IF(ISBLANK('FY25-26 Work Plan'!$I$31:$I$31),\"\",'FY25-26 Work Plan'!$I$31:$I$31)","v":""},{"$f":"IF(ISBLANK('FY25-26 Work Plan'!$B$32:$B$32),\"\",'FY25-26 Work Plan'!$B$32:$B$32)","v":""},{"$f":"IF(ISBLANK('FY25-26 Work Plan'!$E$32:$E$32),\"\",'FY25-26 Work Plan'!$E$32:$E$32)","v":""},{"$f":"IF(ISBLANK('FY25-26 Work Plan'!$I$32:$I$32),\"\",'FY25-26 Work Plan'!$I$32:$I$32)","v":""},{"$f":"IF(ISBLANK('FY25-26 Work Plan'!#REF!),\"\",'FY25-26 Work Plan'!#REF!)","v":{"$error":"#REF!"}},{"$f":"IF(ISBLANK('FY25-26 Work Plan'!#REF!),\"\",'FY25-26 Work Plan'!#REF!)","v":{"$error":"#REF!"}},{"$f":"IF(ISBLANK('FY25-26 Work Plan'!#REF!),\"\",'FY25-26 Work Plan'!#REF!)","v":{"$error":"#REF!"}},{"$f":"IF(ISBLANK('FY25-26 Work Plan'!#REF!),\"\",'FY25-26 Work Plan'!#REF!)","v":{"$error":"#REF!"}},{"$f":"IF(ISBLANK('FY25-26 Work Plan'!#REF!),\"\",'FY25-26 Work Plan'!#REF!)","v":{"$error":"#REF!"}},{"$f":"IF(ISBLANK('FY25-26 Work Plan'!#REF!),\"\",'FY25-26 Work Plan'!#REF!)","v":{"$error":"#REF!"}},{"$f":"IF(ISBLANK('FY25-26 Work Plan'!#REF!),\"\",'FY25-26 Work Plan'!#REF!)","v":{"$error":"#REF!"}},{"$f":"IF(ISBLANK('FY25-26 Work Plan'!#REF!),\"\",'FY25-26 Work Plan'!#REF!)","v":{"$error":"#REF!"}},{"$f":"IF(ISBLANK('FY25-26 Work Plan'!#REF!),\"\",'FY25-26 Work Plan'!#REF!)","v":{"$error":"#REF!"}}]
[{"$f":"IF(ISBLANK('FY25-26 Work Plan'!$E$2:$E$2),\"\",'FY25-26 Work Plan'!$E$2:$E$2)","v":"Asian American Drug Abuse Programs, Inc. (AADAP)"},{"$f":"IF(ISBLANK('FY25-26 Work Plan'!$L$2:$L$2),\"\",'FY25-26 Work Plan'!$L$2:$L$2)","v":"Prevention Education Program (PEP)"},{"$f":"IF(ISBLANK('FY25-26 Work Plan'!$L$3:$L$3),\"\",'FY25-26 Work Plan'!$L$3:$L$3)","v":""},{"$f":"IF(ISBLANK('FY25-26 Work Plan'!$E$3:$E$3),\"\",'FY25-26 Work Plan'!$E$3:$E$3)","v":"PH-005150 "},{"$f":"IF(ISBLANK('FY25-26 Work Plan'!$E$4:$E$4),\"\",TEXT('FY25-26 Work Plan'!$E$4:$E$4,\"000000\"))","v":"000001"},{"$f":"IF(ISBLANK('FY25-26 Work Plan'!$L$4:$L$4),\"\",'FY25-26 Work Plan'!$L$4:$L$4)","v":""},{"$f":"IF(ISBLANK('FY25-26 Work Plan'!$E$5:$E$5),\"\",'FY25-26 Work Plan'!$E$5:$E$5)","v":"2 - San Fernando Valley"},{"$f":"IF(ISBLANK('FY25-26 Work Plan'!$L$5:$L$5),\"\",'FY25-26 Work Plan'!$L$5:$L$5)","v":""},{"$f":"IF(ISBLANK('FY25-26 Work Plan'!$E$6:$E$6),\"\",'FY25-26 Work Plan'!$E$6:$E$6)","v":"Agoura Hills, Agua Dulce*"},{"$f":"IF(ISBLANK('FY25-26 Work Plan'!$F$7:$F$7),\"\",'FY25-26 Work Plan'!$F$7:$F$7)","v":""},{"$f":"IF(ISBLANK('FY25-26 Work Plan'!$F$8:$F$8),\"\",'FY25-26 Work Plan'!$F$8:$F$8)","v":""},{"$f":"IF(ISBLANK('FY25-26 Work Plan'!$E$9:$E$9),\"\",'FY25-26 Work Plan'!$E$9:$E$9)","v":"123 E Main St., Suite 100 \nAnytown, CA 90000"},{"$f":"IF(ISBLANK('FY25-26 Work Plan'!$L$9:$L$9),\"\",TEXT('FY25-26 Work Plan'!$L$9:$L$9,\"###-###-####\"))","v":"999-999-9999"},{"$f":"IF(ISBLANK('FY25-26 Work Plan'!$L$10:$L$10),\"\",'FY25-26 Work Plan'!$L$10:$L$10)","v":"www.abc1.org"},{"$f":"IF(ISBLANK('FY25-26 Work Plan'!$E$11:$E$11),\"\",'FY25-26 Work Plan'!$E$11:$E$11)","v":"123 E Main St., Suite 100 \nAnytown, CA 90000"},{"$f":"IF(ISBLANK('FY25-26 Work Plan'!$L$11:$L$11),\"\",TEXT('FY25-26 Work Plan'!$L$11:$L$11,\"###-###-####\"))","v":"999-999-9999"},{"$f":"IF(ISBLANK('FY25-26 Work Plan'!$L$12:$L$12),\"\",'FY25-26 Work Plan'!$L$12:$L$12)","v":"www.abc2.org"},{"$f":"IF(ISBLANK('FY25-26 Work Plan'!$E$15:$E$15),\"\",'FY25-26 Work Plan'!$E$15:$E$15)","v":"John/Jane Doe"},{"$f":"IF(ISBLANK('FY25-26 Work Plan'!$I$15:$I$15),\"\",TEXT('FY25-26 Work Plan'!$I$15:$I$15,\"###-###-####\"))","v":"213-555-1212"},{"$f":"IF(ISBLANK('FY25-26 Work Plan'!$L$15:$L$15),\"\",'FY25-26 Work Plan'!$L$15:$L$15)","v":"janedoe@preventionusa.com"},{"$f":"IF(ISBLANK('FY25-26 Work Plan'!$E$16:$E$16),\"\",'FY25-26 Work Plan'!$E$16:$E$16)","v":"John/Jane Doe"},{"$f":"IF(ISBLANK('FY25-26 Work Plan'!$I$16:$I$16),\"\",TEXT('FY25-26 Work Plan'!$I$16:$I$16,\"###-###-####\"))","v":"213-555-1212"},{"$f":"IF(ISBLANK('FY25-26 Work Plan'!$L$16:$L$16),\"\",'FY25-26 Work Plan'!$L$16:$L$16)","v":"janedoe@preventionusa.com"},{"$f":"IF(ISBLANK('FY25-26 Work Plan'!$E$17:$E$17),\"\",'FY25-26 Work Plan'!$E$17:$E$17)","v":"John/Jane Doe"},{"$f":"IF(ISBLANK('FY25-26 Work Plan'!$I$17:$I$17),\"\",TEXT('FY25-26 Work Plan'!$I$17:$I$17,\"###-###-####\"))","v":"213-555-1212"},{"$f":"IF(ISBLANK('FY25-26 Work Plan'!$L$17:$L$17),\"\",'FY25-26 Work Plan'!$L$17:$L$17)","v":"j.doe@preventionusa.com"},{"$f":"IF(ISBLANK('FY25-26 Work Plan'!$E$18:$E$18),\"\",'FY25-26 Work Plan'!$E$18:$E$18)","v":"John/Jane Doe"},{"$f":"IF(ISBLANK('FY25-26 Work Plan'!$I$18:$I$18),\"\",TEXT('FY25-26 Work Plan'!$I$18:$I$18,\"###-###-####\"))","v":"213-555-1213"},{"$f":"IF(ISBLANK('FY25-26 Work Plan'!$L$18:$L$18),\"\",'FY25-26 Work Plan'!$L$18:$L$18)","v":"j.doe@preventionusa.com"},{"$f":"IF(ISBLANK('FY25-26 Work Plan'!$E$19:$E$19),\"\",'FY25-26 Work Plan'!$E$19:$E$19)","v":"John/Jane Doe"},{"$f":"IF(ISBLANK('FY25-26 Work Plan'!$I$19:$I$19),\"\",TEXT('FY25-26 Work Plan'!$I$19:$I$19,\"###-###-####\"))","v":"213-555-1213"},{"$f":"IF(ISBLANK('FY25-26 Work Plan'!$L$19:$L$19),\"\",'FY25-26 Work Plan'!$L$19:$L$19)","v":"j.doe@preventionusa.com"},{"$f":"IF(ISBLANK('FY25-26 Work Plan'!$E$23:$E$23),\"\",'FY25-26 Work Plan'!$E$23:$E$23)","v":""},{"$f":"IF(ISBLANK('FY25-26 Work Plan'!$I$23:$I$23),\"\",'FY25-26 Work Plan'!$I$23:$I$23)","v":""},{"$f":"IF(ISBLANK('FY25-26 Work Plan'!$E$24:$E$24),\"\",'FY25-26 Work Plan'!$E$24:$E$24)","v":""},{"$f":"IF(ISBLANK('FY25-26 Work Plan'!$I$24:$I$24),\"\",'FY25-26 Work Plan'!$I$24:$I$24)","v":""},{"$f":"IF(ISBLANK('FY25-26 Work Plan'!$E$25:$E$25),\"\",'FY25-26 Work Plan'!$E$25:$E$25)","v":""},{"$f":"IF(ISBLANK('FY25-26 Work Plan'!$I$25:$I$25),\"\",'FY25-26 Work Plan'!$I$25:$I$25)","v":""},{"$f":"IF(ISBLANK('FY25-26 Work Plan'!$E$26:$E$26),\"\",'FY25-26 Work Plan'!$E$26:$E$26)","v":""},{"$f":"IF(ISBLANK('FY25-26 Work Plan'!$I$26:$I$26),\"\",'FY25-26 Work Plan'!$I$26:$I$26)","v":""},{"$f":"IF(ISBLANK('FY25-26 Work Plan'!$E$27:$E$27),\"\",'FY25-26 Work Plan'!$E$27:$E$27)","v":""},{"$f":"IF(ISBLANK('FY25-26 Work Plan'!$I$27:$I$27),\"\",'FY25-26 Work Plan'!$I$27:$I$27)","v":""},{"$f":"IF(ISBLANK('FY25-26 Work Plan'!$E$28:$E$28),\"\",'FY25-26 Work Plan'!$E$28:$E$28)","v":""},{"$f":"IF(ISBLANK('FY25-26 Work Plan'!$I$28:$I$28),\"\",'FY25-26 Work Plan'!$I$28:$I$28)","v":""},{"$f":"IF(ISBLANK('FY25-26 Work Plan'!$E$29:$E$29),\"\",'FY25-26 Work Plan'!$E$29:$E$29)","v":""},{"$f":"IF(ISBLANK('FY25-26 Work Plan'!$I$29:$I$29),\"\",'FY25-26 Work Plan'!$I$29:$I$29)","v":""},{"$f":"IF(ISBLANK('FY25-26 Work Plan'!$B$30:$B$30),\"\",'FY25-26 Work Plan'!$B$30:$B$30)","v":""},{"$f":"IF(ISBLANK('FY25-26 Work Plan'!$E$30:$E$30),\"\",'FY25-26 Work Plan'!$E$30:$E$30)","v":""},{"$f":"IF(ISBLANK('FY25-26 Work Plan'!$I$30:$I$30),\"\",'FY25-26 Work Plan'!$I$30:$I$30)","v":""},{"$f":"IF(ISBLANK('FY25-26 Work Plan'!$B$31:$B$31),\"\",'FY25-26 Work Plan'!$B$31:$B$31)","v":""},{"$f":"IF(ISBLANK('FY25-26 Work Plan'!$E$31:$E$31),\"\",'FY25-26 Work Plan'!$E$31:$E$31)","v":""},{"$f":"IF(ISBLANK('FY25-26 Work Plan'!$I$31:$I$31),\"\",'FY25-26 Work Plan'!$I$31:$I$31)","v":""},{"$f":"IF(ISBLANK('FY25-26 Work Plan'!$B$32:$B$32),\"\",'FY25-26 Work Plan'!$B$32:$B$32)","v":""},{"$f":"IF(ISBLANK('FY25-26 Work Plan'!$E$32:$E$32),\"\",'FY25-26 Work Plan'!$E$32:$E$32)","v":""},{"$f":"IF(ISBLANK('FY25-26 Work Plan'!$I$32:$I$32),\"\",'FY25-26 Work Plan'!$I$32:$I$32)","v":""},{"$f":"IF(ISBLANK('FY25-26 Work Plan'!#REF!),\"\",'FY25-26 Work Plan'!#REF!)","v":{"$error":"#REF!"}},{"$f":"IF(ISBLANK('FY25-26 Work Plan'!#REF!),\"\",'FY25-26 Work Plan'!#REF!)","v":{"$error":"#REF!"}},{"$f":"IF(ISBLANK('FY25-26 Work Plan'!#REF!),\"\",'FY25-26 Work Plan'!#REF!)","v":{"$error":"#REF!"}},{"$f":"IF(ISBLANK('FY25-26 Work Plan'!#REF!),\"\",'FY25-26 Work Plan'!#REF!)","v":{"$error":"#REF!"}},{"$f":"IF(ISBLANK('FY25-26 Work Plan'!#REF!),\"\",'FY25-26 Work Plan'!#REF!)","v":{"$error":"#REF!"}},{"$f":"IF(ISBLANK('FY25-26 Work Plan'!#REF!),\"\",'FY25-26 Work Plan'!#REF!)","v":{"$error":"#REF!"}},{"$f":"IF(ISBLANK('FY25-26 Work Plan'!#REF!),\"\",'FY25-26 Work Plan'!#REF!)","v":{"$error":"#REF!"}},{"$f":"IF(ISBLANK('FY25-26 Work Plan'!#REF!),\"\",'FY25-26 Work Plan'!#REF!)","v":{"$error":"#REF!"}},{"$f":"IF(ISBLANK('FY25-26 Work Plan'!#REF!),\"\",'FY25-26 Work Plan'!#REF!)","v":{"$error":"#REF!"}}]
[{"$f":"IF(ISBLANK('FY25-26 Work Plan'!$E$2:$E$2),\"\",'FY25-26 Work Plan'!$E$2:$E$2)","v":"Asian American Drug Abuse Programs, Inc. (AADAP)"},{"$f":"IF(ISBLANK('FY25-26 Work Plan'!$L$2:$L$2),\"\",'FY25-26 Work Plan'!$L$2:$L$2)","v":"Prevention Education Program (PEP)"},{"$f":"IF(ISBLANK('FY25-26 Work Plan'!$L$3:$L$3),\"\",'FY25-26 Work Plan'!$L$3:$L$3)","v":""},{"$f":"IF(ISBLANK('FY25-26 Work Plan'!$E$3:$E$3),\"\",'FY25-26 Work Plan'!$E$3:$E$3)","v":"PH-005150 "},{"$f":"IF(ISBLANK('FY25-26 Work Plan'!$E$4:$E$4),\"\",TEXT('FY25-26 Work Plan'!$E$4:$E$4,\"000000\"))","v":"000001"},{"$f":"IF(ISBLANK('FY25-26 Work Plan'!$L$4:$L$4),\"\",'FY25-26 Work Plan'!$L$4:$L$4)","v":""},{"$f":"IF(ISBLANK('FY25-26 Work Plan'!$E$5:$E$5),\"\",'FY25-26 Work Plan'!$E$5:$E$5)","v":"2 - San Fernando Valley"},{"$f":"IF(ISBLANK('FY25-26 Work Plan'!$L$5:$L$5),\"\",'FY25-26 Work Plan'!$L$5:$L$5)","v":""},{"$f":"IF(ISBLANK('FY25-26 Work Plan'!$E$6:$E$6),\"\",'FY25-26 Work Plan'!$E$6:$E$6)","v":"Agoura Hills, Agua Dulce*"},{"$f":"IF(ISBLANK('FY25-26 Work Plan'!$F$7:$F$7),\"\",'FY25-26 Work Plan'!$F$7:$F$7)","v":""},{"$f":"IF(ISBLANK('FY25-26 Work Plan'!$F$8:$F$8),\"\",'FY25-26 Work Plan'!$F$8:$F$8)","v":""},{"$f":"IF(ISBLANK('FY25-26 Work Plan'!$E$9:$E$9),\"\",'FY25-26 Work Plan'!$E$9:$E$9)","v":"123 E Main St., Suite 100 \nAnytown, CA 90000"},{"$f":"IF(ISBLANK('FY25-26 Work Plan'!$L$9:$L$9),\"\",TEXT('FY25-26 Work Plan'!$L$9:$L$9,\"###-###-####\"))","v":"999-999-9999"},{"$f":"IF(ISBLANK('FY25-26 Work Plan'!$L$10:$L$10),\"\",'FY25-26 Work Plan'!$L$10:$L$10)","v":"www.abc1.org"},{"$f":"IF(ISBLANK('FY25-26 Work Plan'!$E$11:$E$11),\"\",'FY25-26 Work Plan'!$E$11:$E$11)","v":"123 E Main St., Suite 100 \nAnytown, CA 90000"},{"$f":"IF(ISBLANK('FY25-26 Work Plan'!$L$11:$L$11),\"\",TEXT('FY25-26 Work Plan'!$L$11:$L$11,\"###-###-####\"))","v":"999-999-9999"},{"$f":"IF(ISBLANK('FY25-26 Work Plan'!$L$12:$L$12),\"\",'FY25-26 Work Plan'!$L$12:$L$12)","v":"www.abc2.org"},{"$f":"IF(ISBLANK('FY25-26 Work Plan'!$E$15:$E$15),\"\",'FY25-26 Work Plan'!$E$15:$E$15)","v":"John/Jane Doe"},{"$f":"IF(ISBLANK('FY25-26 Work Plan'!$I$15:$I$15),\"\",TEXT('FY25-26 Work Plan'!$I$15:$I$15,\"###-###-####\"))","v":"213-555-1212"},{"$f":"IF(ISBLANK('FY25-26 Work Plan'!$L$15:$L$15),\"\",'FY25-26 Work Plan'!$L$15:$L$15)","v":"janedoe@preventionusa.com"},{"$f":"IF(ISBLANK('FY25-26 Work Plan'!$E$16:$E$16),\"\",'FY25-26 Work Plan'!$E$16:$E$16)","v":"John/Jane Doe"},{"$f":"IF(ISBLANK('FY25-26 Work Plan'!$I$16:$I$16),\"\",TEXT('FY25-26 Work Plan'!$I$16:$I$16,\"###-###-####\"))","v":"213-555-1212"},{"$f":"IF(ISBLANK('FY25-26 Work Plan'!$L$16:$L$16),\"\",'FY25-26 Work Plan'!$L$16:$L$16)","v":"janedoe@preventionusa.com"},{"$f":"IF(ISBLANK('FY25-26 Work Plan'!$E$17:$E$17),\"\",'FY25-26 Work Plan'!$E$17:$E$17)","v":"John/Jane Doe"},{"$f":"IF(ISBLANK('FY25-26 Work Plan'!$I$17:$I$17),\"\",TEXT('FY25-26 Work Plan'!$I$17:$I$17,\"###-###-####\"))","v":"213-555-1212"},{"$f":"IF(ISBLANK('FY25-26 Work Plan'!$L$17:$L$17),\"\",'FY25-26 Work Plan'!$L$17:$L$17)","v":"j.doe@preventionusa.com"},{"$f":"IF(ISBLANK('FY25-26 Work Plan'!$E$18:$E$18),\"\",'FY25-26 Work Plan'!$E$18:$E$18)","v":"John/Jane Doe"},{"$f":"IF(ISBLANK('FY25-26 Work Plan'!$I$18:$I$18),\"\",TEXT('FY25-26 Work Plan'!$I$18:$I$18,\"###-###-####\"))","v":"213-555-1213"},{"$f":"IF(ISBLANK('FY25-26 Work Plan'!$L$18:$L$18),\"\",'FY25-26 Work Plan'!$L$18:$L$18)","v":"j.doe@preventionusa.com"},{"$f":"IF(ISBLANK('FY25-26 Work Plan'!$E$19:$E$19),\"\",'FY25-26 Work Plan'!$E$19:$E$19)","v":"John/Jane Doe"},{"$f":"IF(ISBLANK('FY25-26 Work Plan'!$I$19:$I$19),\"\",TEXT('FY25-26 Work Plan'!$I$19:$I$19,\"###-###-####\"))","v":"213-555-1213"},{"$f":"IF(ISBLANK('FY25-26 Work Plan'!$L$19:$L$19),\"\",'FY25-26 Work Plan'!$L$19:$L$19)","v":"j.doe@preventionusa.com"},{"$f":"IF(ISBLANK('FY25-26 Work Plan'!$E$23:$E$23),\"\",'FY25-26 Work Plan'!$E$23:$E$23)","v":""},{"$f":"IF(ISBLANK('FY25-26 Work Plan'!$I$23:$I$23),\"\",'FY25-26 Work Plan'!$I$23:$I$23)","v":""},{"$f":"IF(ISBLANK('FY25-26 Work Plan'!$E$24:$E$24),\"\",'FY25-26 Work Plan'!$E$24:$E$24)","v":""},{"$f":"IF(ISBLANK('FY25-26 Work Plan'!$I$24:$I$24),\"\",'FY25-26 Work Plan'!$I$24:$I$24)","v":""},{"$f":"IF(ISBLANK('FY25-26 Work Plan'!$E$25:$E$25),\"\",'FY25-26 Work Plan'!$E$25:$E$25)","v":""},{"$f":"IF(ISBLANK('FY25-26 Work Plan'!$I$25:$I$25),\"\",'FY25-26 Work Plan'!$I$25:$I$25)","v":""},{"$f":"IF(ISBLANK('FY25-26 Work Plan'!$E$26:$E$26),\"\",'FY25-26 Work Plan'!$E$26:$E$26)","v":""},{"$f":"IF(ISBLANK('FY25-26 Work Plan'!$I$26:$I$26),\"\",'FY25-26 Work Plan'!$I$26:$I$26)","v":""},{"$f":"IF(ISBLANK('FY25-26 Work Plan'!$E$27:$E$27),\"\",'FY25-26 Work Plan'!$E$27:$E$27)","v":""},{"$f":"IF(ISBLANK('FY25-26 Work Plan'!$I$27:$I$27),\"\",'FY25-26 Work Plan'!$I$27:$I$27)","v":""},{"$f":"IF(ISBLANK('FY25-26 Work Plan'!$E$28:$E$28),\"\",'FY25-26 Work Plan'!$E$28:$E$28)","v":""},{"$f":"IF(ISBLANK('FY25-26 Work Plan'!$I$28:$I$28),\"\",'FY25-26 Work Plan'!$I$28:$I$28)","v":""},{"$f":"IF(ISBLANK('FY25-26 Work Plan'!$E$29:$E$29),\"\",'FY25-26 Work Plan'!$E$29:$E$29)","v":""},{"$f":"IF(ISBLANK('FY25-26 Work Plan'!$I$29:$I$29),\"\",'FY25-26 Work Plan'!$I$29:$I$29)","v":""},{"$f":"IF(ISBLANK('FY25-26 Work Plan'!$B$30:$B$30),\"\",'FY25-26 Work Plan'!$B$30:$B$30)","v":""},{"$f":"IF(ISBLANK('FY25-26 Work Plan'!$E$30:$E$30),\"\",'FY25-26 Work Plan'!$E$30:$E$30)","v":""},{"$f":"IF(ISBLANK('FY25-26 Work Plan'!$I$30:$I$30),\"\",'FY25-26 Work Plan'!$I$30:$I$30)","v":""},{"$f":"IF(ISBLANK('FY25-26 Work Plan'!$B$31:$B$31),\"\",'FY25-26 Work Plan'!$B$31:$B$31)","v":""},{"$f":"IF(ISBLANK('FY25-26 Work Plan'!$E$31:$E$31),\"\",'FY25-26 Work Plan'!$E$31:$E$31)","v":""},{"$f":"IF(ISBLANK('FY25-26 Work Plan'!$I$31:$I$31),\"\",'FY25-26 Work Plan'!$I$31:$I$31)","v":""},{"$f":"IF(ISBLANK('FY25-26 Work Plan'!$B$32:$B$32),\"\",'FY25-26 Work Plan'!$B$32:$B$32)","v":""},{"$f":"IF(ISBLANK('FY25-26 Work Plan'!$E$32:$E$32),\"\",'FY25-26 Work Plan'!$E$32:$E$32)","v":""},{"$f":"IF(ISBLANK('FY25-26 Work Plan'!$I$32:$I$32),\"\",'FY25-26 Work Plan'!$I$32:$I$32)","v":""},{"$f":"IF(ISBLANK('FY25-26 Work Plan'!#REF!),\"\",'FY25-26 Work Plan'!#REF!)","v":{"$error":"#REF!"}},{"$f":"IF(ISBLANK('FY25-26 Work Plan'!#REF!),\"\",'FY25-26 Work Plan'!#REF!)","v":{"$error":"#REF!"}},{"$f":"IF(ISBLANK('FY25-26 Work Plan'!#REF!),\"\",'FY25-26 Work Plan'!#REF!)","v":{"$error":"#REF!"}},{"$f":"IF(ISBLANK('FY25-26 Work Plan'!#REF!),\"\",'FY25-26 Work Plan'!#REF!)","v":{"$error":"#REF!"}},{"$f":"IF(ISBLANK('FY25-26 Work Plan'!#REF!),\"\",'FY25-26 Work Plan'!#REF!)","v":{"$error":"#REF!"}},{"$f":"IF(ISBLANK('FY25-26 Work Plan'!#REF!),\"\",'FY25-26 Work Plan'!#REF!)","v":{"$error":"#REF!"}},{"$f":"IF(ISBLANK('FY25-26 Work Plan'!#REF!),\"\",'FY25-26 Work Plan'!#REF!)","v":{"$error":"#REF!"}},{"$f":"IF(ISBLANK('FY25-26 Work Plan'!#REF!),\"\",'FY25-26 Work Plan'!#REF!)","v":{"$error":"#REF!"}},{"$f":"IF(ISBLANK('FY25-26 Work Plan'!#REF!),\"\",'FY25-26 Work Plan'!#REF!)","v":{"$error":"#REF!"}}]

{"sheet":"Data Validation Instructions","index":5,"n_rows":74,"n_cols":12,"rows_kept":74,"cut":false,"hidden":true,"merged":[]}
["INTERNAL INSTRUCTIONS FOR SAPC: "]
["HOW TO EDIT EXISTING DATA VALIDATIONS (DROP-DOWN LISTS)"]
[]
["Optional: The following website is a great resource for learning about Excel Data Validation."]
["https://exceljet.net/excel-data-validation-guide"]
[]
["1)","Select the cell with the drop-down list.  For this example, cell E2 was selected, which has the drop-down list for Contractor Names."]
[]
[]
[]
[]
[]
["2)","In the toolbar, go to the Data tab and click on Data Validation."]
[]
[]
[]
[]
[]
[]
[]
["3)","In the Data Validation window that pops up, place your mouse cursor in the Source field.  This will take you to the location of your drop-down list, which is in the Data Validation tab, cells H2:H30."]
[]
[]
[]
[]
[]
[]
[]
[]
[]
[]
[]
[]
[]
[]
[]
[]
[]
[]
[]
[]
[]
[]
[]
[]
["4)","Now that you have verified the location/range of your drop-down list, you may edit the drop-down list. "]
[null,"You may modify, add, or delete any of the cells in H2:H30 to make changes to your drop-down list. "]
[null,"If adding or deleting an entry, ensure to update your range in the Source field."]
[]
["5)","In the Data Validation window, you may also edit the Input Message and Error Alert."]
[null,null,"Input Message:",null,null,null,null,null,null,null,null,"Error Alert:"]
[]
[]
[]
[]
[]
[]
[]
[]
[]
[]
[]
[]
[]
[]
[]
[]
[]
[]
[]
[]
[]
[]
["6)","To completely remove the drop-down list from a cell, open the Data Validation window and click on Clear All, then click OK."]